program: Gaussian 09
title: 000266845
version: EM64L-G09RevD.01
frameworkgroup: C1[X(C16H17NO3)]
method: RPBEPBE
basis: SDD
operation: Freq
keyword: #p
keyword: freq=noraman
keyword: PBEPBE/SDD
title: #p freq=noraman PBEPBE/SDD
converged: YES YES NO NO
title: Mulliken charges:
elementType: O O O N C C C C C C C C C C C C C C C C H H H H H H H H H H H H H H H H H
charge: -0.285839 -0.282548 -0.307083 -0.674830 0.212713 0.346288 0.048976 -0.504350 -0.561662 0.163555 0.219117 0.195707 -0.813746 0.289382 -0.336357 -0.418394 -0.294188 -0.205248 -0.537678 -0.515653 0.279418 0.259665 0.218295 0.227142 0.262315 0.267129 0.219033 0.229446 0.225661 0.379184 0.297959 0.227839 0.224744 0.242682 0.228996 0.259212 0.213118
chargesum: 0.00000
title: Mulliken charges with hydrogens summed into heavy atoms:
elementType: O O O N C C C C C C C C C C C C C C C C
charge: -0.285839 -0.282548 -0.307083 0.002314 0.212713 0.346288 0.048976 -0.224932 -0.301998 0.163555 0.219117 0.195707 -0.105994 0.289382 -0.069228 -0.199361 -0.064741 0.020413 0.157587 0.185673
polarizability: 2.98028712e+02 -7.77149908e+00 2.06498771e+02 -1.36868511e+01 -1.30477071e+01 1.26273555e+02
1716.lowfreq: -7.4012 0.0002 0.0006 0.0009 2.6927 6.2014 29.3770 34.1178 49.0404
frequency: 29.3608 34.0312 49.0401 59.0470 79.5025 106.2547 114.0826 140.3051 146.6161 151.8449 202.0588 215.2270 222.8025 225.3520 240.9896 270.8530 287.7025 325.7997 358.1340 370.4319 402.7456 425.9966 431.2542 464.5525 475.6981 488.0390 498.5946 524.5056 531.9400 562.7654 600.1418 660.3936 664.6819 701.2102 708.0425 732.1000 759.6011 763.7978 783.3484 806.6790 819.2778 852.1017 870.8174 883.2708 888.2007 944.1696 961.1999 980.4208 981.2268 1019.3295 1023.8103 1044.7786 1056.6037 1084.8668 1110.4974 1112.1633 1138.7324 1151.8177 1158.0714 1170.0657 1176.6767 1191.0627 1258.0933 1264.9669 1280.5568 1304.9850 1332.0056 1363.8675 1377.6173 1401.1062 1404.6447 1421.3060 1431.1041 1443.0208 1454.8512 1458.6804 1465.6067 1465.9803 1474.6709 1476.8558 1477.7967 1500.9236 1511.3334 1556.5307 1567.9266 1588.4480 1610.2532 1626.4772 2961.0036 2980.5227 2990.1123 3049.9872 3075.8929 3090.1549 3090.8493 3117.7654 3123.3207 3131.0213 3137.4005 3149.1933 3150.6074 3160.0450 3169.1309 3326.5572 3631.0875
redmass: 4.7696 2.7733 4.3115 2.8421 3.0920 2.3092 1.2585 5.0306 1.7498 4.3291 2.7399 3.7743 3.3775 3.2238 1.8313 3.2370 3.0158 3.6395 4.9819 4.4364 7.7945 3.2568 3.2122 3.0413 3.8115 1.5275 3.9740 3.9519 3.5855 6.7842 5.4250 4.8053 6.3079 4.3753 6.0959 3.0121 1.8344 1.9499 2.6311 2.9397 1.9941 1.6315 1.5615 5.4505 1.4090 6.0227 1.3480 3.7547 1.3858 1.6395 2.2106 1.5333 1.8345 4.5611 1.2392 1.2582 1.7969 1.3807 1.4007 1.9644 1.1800 1.8753 4.7974 1.3695 1.9058 3.3132 2.2228 5.4126 5.6016 1.3830 4.0687 2.7759 1.2283 1.2510 1.0687 1.0783 1.0573 2.2722 1.1083 1.1293 1.0579 2.8857 4.5972 5.3693 5.4159 1.5647 6.3081 6.2557 1.0327 1.0345 1.0364 1.1041 1.0971 1.1005 1.0970 1.0864 1.0998 1.1052 1.0898 1.0928 1.0913 1.0901 1.0992 1.0596 1.0915
irintensity: 0.7963 4.3684 0.6951 2.0643 7.6569 3.1381 0.5613 1.0151 0.5095 3.1121 2.9082 2.5347 0.5779 1.1793 3.1068 7.2400 4.6421 7.6071 3.9168 13.3516 3.3522 17.3558 0.9829 11.8488 2.8956 100.0595 3.9771 16.5865 15.6549 0.0011 12.9457 1.8234 29.8743 20.4490 2.4156 15.5230 46.8078 72.2556 67.1725 13.4218 40.9754 3.4014 18.3812 34.9997 26.5960 6.5241 1.4588 39.6432 4.8293 22.4650 6.0056 8.1912 1.8481 98.1157 11.9187 0.1732 44.6740 11.4690 12.8188 137.1357 4.9106 40.7257 79.3807 52.1456 209.4900 401.3192 17.1530 4.6375 5.1168 36.9697 1.6044 29.5294 0.5280 0.2028 14.0496 29.4934 19.9516 34.7280 70.2852 40.0186 23.0867 47.0714 279.3686 109.8206 1.7750 259.5143 33.5903 173.0267 51.4916 100.6959 27.7789 41.0425 15.8206 21.5116 39.4639 8.9703 24.9166 17.6902 15.6320 29.4854 5.5284 1.8916 18.8018 112.2497 61.3871
temp: 298.150 k
press: 1.00000 atm
elementType: 8 8 8 7 6 6 6 6 6 6 6 6 6 6 6 6 6 6 6 6 1 1 1 1 1 1 1 1 1 1 1 1 1 1 1 1 1
symmnumber: 1
zpe: 772123.4 jmol-1
zpe.correction: 0.294086 hartree
zpe.thermalcorrener: 0.313559 hartree
zpe.thermalcorrenthalpy: 0.314503 hartree
zpe.thermalcorrgfe: 0.245560 hartree
zpe.sumelectzpe: -898.861021 hartree
zpe.sumelectthermal: -898.841549 hartree
zpe.sumelectthermalent: -898.840605 hartree
zpe.sumelectthermalfe: -898.909547 hartree
dipole: 1.4383 -3.0374 -1.4651
dipole: 3.6662
quadrupole: -98.6385 -108.9636 -118.2084
quadrupole: 1.2874 1.7648 2.2388
quadrupole: 9.9650 -0.3601 -9.6049 1.2874 1.7648 2.2388
hfenergy: -899.1551074 hartree
pointgroup: C01 [X(C16H17N1O3)]
dipole: -0.4232313 1.1611089 -0.7437456 debye
polarizability: 293.5579542|-13.302316|209.9791025|26.6741023|1.2783008|127.2639808 unknown
InChI: InChI=1S/C16H17NO3/c1-10-8-14(19-2)15(20-3)9-12(10)16(18)11-6-4-5-7-13(11)17/h4-9H,17H2,1-3H3
charge 0 multiplicity 1
37 atoms
O  3.075406 1.569709 -0.293637
O  4.418167 -0.591804 1.05982
O  -1.558009 -2.17514 -0.698845
N  -3.850358 -1.056603 -1.313422
C  0.269242 -0.918182 0.223744
C  0.975945 -1.971395 0.879097
C  -1.180191 -1.06915 -0.149031
C  0.965907 0.25396 -0.178093
C  2.357857 -1.790974 1.113016
C  -2.137915 0.037507 0.077758
C  2.347775 0.413495 0.052435
C  3.063353 -0.63717 0.705357
C  0.302972 -3.2564 1.329193
C  -3.451618 0.011321 -0.540381
C  -1.817968 1.133956 0.937452
C  -4.33419 1.12032 -0.333828
C  -2.707221 2.196453 1.154182
C  -3.967831 2.189044 0.493703
C  2.335041 2.66757 -0.9207
C  5.403352 -0.097232 0.075355
H  0.406713 1.040698 -0.692175
H  2.936765 -2.567181 1.624411
H  0.964319 -3.826658 2.003813
H  -0.646606 -3.059588 1.858425
H  0.047573 -3.888807 0.461494
H  -0.855265 1.120554 1.45756
H  -5.317857 1.109911 -0.819376
H  -2.440714 3.015359 1.829494
H  -4.669218 3.017754 0.645877
H  -3.208204 -1.86299 -1.35651
H  -4.759085 -1.052213 -1.770698
H  1.527501 3.036468 -0.25905
H  1.905703 2.361581 -1.894433
H  3.079157 3.462549 -1.076891
H  6.380152 -0.263832 0.554567
H  5.247335 0.970623 -0.14204
H  5.338914 -0.684116 -0.860944
