program: Gaussian 09
title: 000266840
version: EM64L-G09RevD.01
frameworkgroup: C1[X(C15H15NO)]
method: RPBEPBE
basis: SDD
operation: Freq
keyword: #p
keyword: freq=noraman
keyword: PBEPBE/SDD
title: #p freq=noraman PBEPBE/SDD
converged: NO YES NO NO
title: Mulliken charges:
elementType: O N C C C C C C C C C C C C C C C H H H H H H H H H H H H H H H
charge: -0.226681 -0.682140 0.273914 0.334313 0.316498 -0.550510 -0.005644 0.170402 -0.387533 -0.414102 -0.817071 0.308993 -0.806524 -0.337615 -0.418899 -0.282032 -0.207985 0.271972 0.273342 0.234757 0.235880 0.223263 0.230086 0.230971 0.225829 0.232719 0.262903 0.212650 0.229673 0.224033 0.341012 0.303526
chargesum: 0.00000
title: Mulliken charges with hydrogens summed into heavy atoms:
elementType: O N C C C C C C C C C C C C C C C
charge: -0.226681 -0.037602 0.273914 0.334313 0.316498 -0.278538 -0.005644 0.170402 -0.114190 -0.179346 -0.127842 0.308993 -0.117005 -0.074711 -0.206249 -0.052360 0.016048
polarizability: 2.54379748e+02 -4.88136771e+00 1.68640733e+02 -1.95281950e+01 -4.58934376e+00 1.13865301e+02
1716.lowfreq: -9.4065 -1.1581 -0.0006 -0.0004 0.0004 6.9633 37.2674 48.0914 66.2382
frequency: 37.1353 48.0910 66.2249 108.0730 114.5446 140.2867 158.0301 165.8971 227.9117 233.9596 261.7879 288.9239 294.4608 342.3038 380.0744 390.8113 417.0718 428.7004 437.8466 448.8375 514.5066 520.7954 527.4504 547.5802 579.8199 621.3238 663.9155 691.2551 729.7903 738.7209 756.1455 778.2070 822.8748 847.1232 855.5803 867.2709 920.5582 946.7418 956.0061 975.8327 978.0037 994.0282 1001.6586 1014.1137 1031.6196 1051.1829 1052.7456 1119.2233 1131.9764 1152.9125 1174.2579 1191.9349 1236.0176 1268.2713 1276.7552 1295.7895 1323.5610 1370.2792 1390.4675 1393.2227 1396.6888 1407.4339 1446.2728 1460.9170 1467.6309 1475.0036 1476.9759 1484.4502 1494.4274 1523.3636 1571.3957 1577.6062 1613.9191 1619.6190 1642.8530 2969.6169 2971.0972 3040.5824 3044.5503 3085.8531 3088.4272 3113.4228 3126.5349 3129.6168 3137.4679 3147.9751 3160.2339 3169.4982 3547.6488 3689.9558
redmass: 4.5417 4.0696 4.0095 3.6454 1.1606 3.6921 1.1301 3.3646 3.6656 4.1688 4.6891 3.2268 3.0369 5.2834 3.1150 1.2977 1.3404 2.2846 3.4489 2.3679 3.8324 3.9717 3.9370 5.9160 4.4084 5.9367 5.6785 3.7668 3.1925 4.0399 1.5638 2.4038 5.4241 1.5653 1.6322 3.8217 1.3722 2.4087 1.5303 1.3727 1.3371 1.6372 1.6741 1.7094 1.4638 1.9055 1.6546 2.1723 1.6239 1.5776 1.0567 2.2343 2.1926 2.1684 2.0737 1.8837 1.7982 5.9991 7.7215 1.3636 2.4574 1.3172 2.7235 1.0481 1.1609 1.0494 1.2171 2.7735 2.3223 9.2111 6.4426 6.7774 5.4304 5.1826 1.2457 1.0378 1.0384 1.0968 1.0966 1.0984 1.0978 1.0872 1.0892 1.0910 1.0892 1.0926 1.0954 1.1001 1.0453 1.1038
irintensity: 0.6933 0.0866 0.5876 2.9075 0.8347 0.6378 1.3786 0.9678 2.6890 3.9033 2.1097 4.6371 2.7220 7.8209 12.2257 164.4197 69.1743 10.9832 2.5937 11.5360 5.9046 7.6602 3.0934 3.9275 0.2351 13.5430 2.2149 17.3792 4.6788 2.2781 89.0380 14.1157 2.1966 21.2760 0.9955 36.7882 3.7238 28.8323 14.5358 3.6077 3.8167 0.5363 5.3437 4.6282 13.5821 11.4778 0.1258 16.1135 23.1563 21.6171 9.6058 2.5445 31.4363 45.8357 119.7316 80.7565 89.7682 3.4924 10.6247 5.5787 6.4210 13.2521 78.5432 1.7548 28.1870 23.3011 1.7853 81.6790 0.5387 161.7984 45.0520 20.7571 61.9386 64.4708 143.2866 52.0837 14.4334 38.0086 0.6167 33.1086 5.9333 11.9304 23.9296 1.8940 14.1705 13.2929 7.7482 27.3367 66.9075 46.3519
temp: 298.150 k
press: 1.00000 atm
elementType: 8 7 6 6 6 6 6 6 6 6 6 6 6 6 6 6 6 1 1 1 1 1 1 1 1 1 1 1 1 1 1 1
symmnumber: 1
zpe: 678172.1 jmol-1
zpe.correction: 0.258302 hartree
zpe.thermalcorrener: 0.274164 hartree
zpe.thermalcorrenthalpy: 0.275108 hartree
zpe.thermalcorrgfe: 0.215118 hartree
zpe.sumelectzpe: -709.385231 hartree
zpe.sumelectthermal: -709.369369 hartree
zpe.sumelectthermalent: -709.368425 hartree
zpe.sumelectthermalfe: -709.428415 hartree
dipole: -2.7471 -4.8413 1.2804
dipole: 5.7118
quadrupole: -85.7937 -102.8119 -97.1682
quadrupole: -5.0960 -1.9823 -2.4089
quadrupole: 9.4643 -7.5540 -1.9103 -5.0960 -1.9823 -2.4089
hfenergy: -709.6435328 hartree
pointgroup: C01 [X(C15H15N1O1)]
dipole: -0.9250536 1.4203797 -1.4753403 debye
polarizability: 251.7517223|13.7406491|150.2647819|24.0799495|-25.3089416|134.8692785 unknown
InChI: InChI=1S/C15H15NO/c1-10-7-8-12(9-11(10)2)15(17)13-5-3-4-6-14(13)16/h3-9H,16H2,1-2H3
charge 0 multiplicity 1
32 atoms
O  0.667126 -2.145124 1.621608
N  1.165287 0.156052 -1.844686
C  -0.795703 -0.671941 0.426047
C  -2.422941 1.115072 -0.112617
C  -3.453592 0.131784 -0.245151
C  -1.11138 0.696477 0.210516
C  0.571495 -1.116247 0.874783
C  1.802199 -0.341144 0.511243
C  -1.829041 -1.63711 0.315158
C  -3.133125 -1.233755 -0.029118
C  -2.726819 2.589611 -0.308871
C  2.052448 0.254554 -0.776448
C  -4.871372 0.538963 -0.597766
C  2.824797 -0.285839 1.500538
C  3.298637 0.923325 -0.987792
C  4.043114 0.377279 1.282492
C  4.270636 0.990005 0.022823
H  -0.321161 1.4485 0.321238
H  -1.58983 -2.686736 0.514813
H  -3.925042 -1.985993 -0.124724
H  -1.819768 3.204177 -0.182904
H  -3.136684 2.792639 -1.317199
H  -3.481432 2.948961 0.417167
H  -5.297309 1.220904 0.163466
H  -4.912418 1.079637 -1.563056
H  -5.534115 -0.339333 -0.672731
H  2.623458 -0.786707 2.453538
H  3.494982 1.378925 -1.966774
H  4.802483 0.420226 2.069146
H  5.213687 1.513666 -0.172331
H  0.236381 -0.240259 -1.730849
H  1.409503 0.564832 -2.742452
