program: Gaussian 09
title: 000266837
version: EM64L-G09RevD.01
frameworkgroup: C1[X(C15H12O)]
method: RPBEPBE
basis: SDD
operation: Freq
keyword: #pfreq=noraman
keyword: PBEPBE/SDD
title: #p freq=noraman PBEPBE/SDD
converged: NO YES NO NO
title: Mulliken charges:
elementType: O C C C C C C C C C C C C C C C H H H H H H H H H H H H
charge: -0.158260 0.295880 0.205013 0.265715 0.227333 -0.313141 -0.601713 0.359374 0.354480 -0.623396 -0.396904 -0.421238 -0.821103 -0.818430 -0.222248 -0.234095 0.247201 0.278040 0.245561 0.278726 0.233415 0.230805 0.230897 0.227691 0.227849 0.238630 0.229304 0.234614
chargesum: 0.00000
title: Mulliken charges with hydrogens summed into heavy atoms:
elementType: O C C C C C C C C C C C C C C C
charge: -0.158260 0.295880 0.205013 0.265715 0.227333 -0.313141 -0.354512 0.359374 0.354480 -0.345356 -0.151343 -0.142511 -0.125985 -0.124261 0.007056 0.000519
polarizability: 2.73735872e+02 -2.91529901e+00 1.79943501e+02 -7.90837263e-03 2.66470875e-03 7.09190443e+01
1716.lowfreq: -5.9468 -5.9404 -0.0008 -0.0005 -0.0004 5.7561 72.5788 90.7916 112.1262
frequency: 72.5759 90.7895 112.1040 139.6749 156.1148 162.8056 203.4170 238.0914 255.5689 291.7725 344.5119 349.7841 370.3205 419.1462 441.8050 483.1518 522.0692 529.3214 583.8263 612.4330 631.1960 691.7187 693.2779 727.4844 744.4242 754.8902 785.5706 834.6853 869.0878 891.2346 907.1586 931.1140 967.0822 973.4287 995.5925 1001.7324 1004.2801 1025.9978 1028.9963 1051.8723 1068.9218 1107.8744 1163.8978 1169.5563 1182.0210 1202.4624 1252.1371 1261.0605 1298.3958 1361.6174 1391.4685 1402.5158 1405.1451 1419.2358 1447.1207 1454.1232 1460.2342 1474.5874 1475.7370 1479.3136 1489.8073 1591.1062 1597.9379 1602.2486 1623.1080 1638.9735 2968.6018 2970.3020 3039.0180 3043.4419 3085.5409 3088.5662 3125.1585 3128.1972 3139.6237 3140.3629 3150.7531 3166.4874
redmass: 3.8923 3.6716 1.0415 4.5583 4.2905 1.2410 2.7843 3.5467 7.7316 2.5673 4.0794 4.3702 4.9108 3.1361 2.9104 4.1980 4.3163 5.5138 6.5137 3.7445 6.0963 3.5708 6.6977 6.3501 4.1443 1.4692 2.7581 2.8145 6.0397 1.3377 1.6325 1.5495 1.4838 2.6603 1.3559 1.6423 1.8055 1.9131 1.4693 1.6671 3.2974 2.1739 1.7152 2.0738 1.8478 2.5365 1.7039 1.7145 2.0793 6.9096 1.2329 2.3365 1.4184 3.9183 2.4834 2.2904 1.0471 1.5165 1.0458 1.1946 2.8546 8.5359 8.1273 7.1531 7.6463 9.6394 1.0376 1.0386 1.0967 1.0966 1.0985 1.0977 1.0909 1.0867 1.0917 1.0903 1.0947 1.1003
irintensity: 3.0931 0.0181 0.0269 0.2752 0.7912 0.7281 0.3241 0.7621 4.1674 0.0128 1.2513 0.2689 0.0728 7.5019 2.3567 5.1652 3.7393 1.1115 1.3148 0.0032 2.4392 7.7460 1.7248 0.0168 0.4673 70.5999 21.3123 0.7922 27.2773 8.0361 4.8743 5.0046 4.9857 30.1541 0.0601 1.1727 0.1540 0.6013 19.2070 0.0341 0.5433 43.0898 4.7692 12.2802 27.1299 19.3538 11.3989 0.5933 36.1975 2.8398 8.6456 1.3152 23.9500 23.4105 29.4313 29.4761 0.7142 14.6991 32.5316 8.5683 4.6291 12.3297 184.4521 6.4146 109.5992 47.1007 59.6925 13.5118 38.7664 0.0378 30.3385 5.3983 11.8444 3.2550 5.3389 7.3826 16.8722 33.7017
temp: 298.150 k
press: 1.00000 atm
elementType: 8 6 6 6 6 6 6 6 6 6 6 6 6 6 6 6 1 1 1 1 1 1 1 1 1 1 1 1
symmnumber: 1
zpe: 579930.3 jmol-1
zpe.correction: 0.220884 hartree
zpe.thermalcorrener: 0.234033 hartree
zpe.thermalcorrenthalpy: 0.234977 hartree
zpe.thermalcorrgfe: 0.181614 hartree
zpe.sumelectzpe: -652.949821 hartree
zpe.sumelectthermal: -652.936671 hartree
zpe.sumelectthermalent: -652.935727 hartree
zpe.sumelectthermalfe: -652.989091 hartree
dipole: -1.7883 -4.0469 0.0006
dipole: 4.4244
quadrupole: -71.6790 -94.9023 -97.2726
quadrupole: -4.3683 -0.0017 0.0013
quadrupole: 16.2723 -6.9510 -9.3213 -4.3683 -0.0017 0.0013
hfenergy: -653.1707043 hartree
pointgroup: C01 [X(C15H12O1)]
dipole: -0.6840451 1.6006662 -0.0002215 debye
polarizability: 273.7931309|1.7678389|179.886242|0.0079404|0.0025678|70.9190443 unknown
InChI: InChI=1S/C15H12O/c1-9-7-13-11-5-3-4-6-12(11)15(16)14(13)8-10(9)2/h3-8H,1-2H3
charge 0 multiplicity 1
28 atoms
O  0.901788 -2.925433 0.000253
C  -0.21361 0.505405 0.000141
C  -0.517457 -0.886317 0.000164
C  1.266286 0.666551 0.000156
C  1.859648 -0.632028 0.000191
C  0.765429 -1.669889 0.000217
C  -1.25771 1.443297 0.000098
C  -2.611615 1.000433 0.000065
C  -2.91082 -0.401005 0.000087
C  -1.844165 -1.339758 0.00016
C  2.081455 1.811635 0.000129
C  3.250964 -0.807262 0.000187
C  -3.73451 2.02054 0.000036
C  -4.350139 -0.882517 -0.000252
C  3.492659 1.640184 0.000127
C  4.074668 0.349211 0.000154
H  -1.04997 2.51984 0.000078
H  -2.052227 -2.415642 0.000228
H  1.651165 2.819181 0.000112
H  3.680862 -1.814389 0.000216
H  -3.341859 3.051028 -0.001526
H  -4.388071 1.904656 -0.886142
H  -4.386201 1.906717 0.887882
H  -4.903933 -0.516235 0.885824
H  -4.901837 -0.520626 -0.889481
H  -4.401059 -1.984023 0.002345
H  4.141747 2.523246 0.000099
H  5.165014 0.245605 0.000148
