program: Gaussian 09
title: 000266833
version: EM64L-G09RevD.01
frameworkgroup: C1[X(C14H13N3O4)]
method: RPBEPBE
basis: SDD
operation: Freq
keyword: #p
keyword: freq=noraman
keyword: PBEPBE/SDD
title: #p freq=noraman PBEPBE/SDD
converged: YES YES NO NO
title: Mulliken charges:
elementType: O O O O N N N C C C C C C C C C C C C C C H H H H H H H H H H H H H
charge: -0.195598 -0.190688 -0.219006 -0.211287 -0.237041 0.007110 0.015842 0.299597 -0.395120 0.430662 0.296419 -0.300519 -0.662739 -0.514507 0.429752 -0.371995 -0.361780 -0.427992 -0.197760 -0.212276 -0.239010 0.234385 0.242408 0.254794 0.243508 0.226114 0.228899 0.327638 0.291157 0.261743 0.243548 0.234780 0.232966 0.235996
chargesum: 0.00000
title: Mulliken charges with hydrogens summed into heavy atoms:
elementType: O O O O N N N C C C C C C C C C C C C C C
charge: -0.195598 -0.190688 -0.219006 -0.211287 -0.237041 0.007110 0.015842 0.299597 0.081674 0.430662 0.296419 -0.045726 0.035782 -0.186868 0.429752 -0.110253 -0.118232 -0.136835 0.037020 0.020690 -0.003014
polarizability: 3.41388326e+02 7.91961939e+00 1.93249946e+02 1.58596952e+01 -1.13470956e+01 1.24162112e+02
1716.lowfreq: -13.2716 -4.6033 0.0002 0.0004 0.0008 3.3369 29.8843 49.3873 56.6903
frequency: 29.8012 49.3545 56.6661 61.0909 65.2895 80.9615 99.5952 131.0130 153.5393 158.9429 189.5593 207.1099 237.5227 261.9420 278.4210 315.2550 343.0859 359.7394 405.3195 415.2365 436.7202 446.6139 486.4557 506.7494 531.4342 555.4513 606.1059 613.9888 626.5095 638.8090 672.6555 692.8336 703.0342 707.1245 732.6650 753.0673 766.5918 775.5743 823.1009 838.3542 856.0782 891.8914 912.3755 934.0234 957.8551 972.8897 984.9670 988.3653 995.4437 1023.2682 1042.1670 1065.3222 1082.3914 1091.8492 1118.8968 1132.8463 1155.4865 1175.1163 1185.2941 1196.2884 1214.4332 1227.9597 1263.7530 1270.9387 1314.1004 1340.1085 1348.2482 1362.6218 1372.4851 1382.4673 1387.4499 1393.6943 1441.3870 1445.1447 1468.1450 1478.8860 1481.8449 1490.6575 1499.4176 1563.5254 1591.3991 1601.8265 1616.9272 2991.1811 3026.6509 3073.5746 3090.0503 3099.9897 3133.6823 3138.7916 3150.6671 3159.2637 3172.5302 3173.4450 3185.1407 3190.8862
redmass: 7.1019 5.5243 6.7386 4.0110 8.0486 4.3482 4.9269 5.2002 6.6943 7.3461 4.5366 1.1954 4.5524 4.4838 6.3013 8.3979 2.7896 6.9282 2.8355 4.0089 4.3640 5.5779 4.3832 7.7334 4.2868 3.6308 4.9813 5.8199 6.1442 7.4997 7.5566 2.0620 6.6402 5.8498 4.8972 12.2524 1.7386 1.3461 1.4775 1.2634 3.6431 4.3649 1.5216 2.3808 1.4350 1.4025 1.3449 4.3893 1.4076 2.3486 3.1842 2.3069 1.7313 1.7939 5.3907 1.7271 1.3720 1.0524 1.1374 9.6667 4.1161 3.7590 1.6380 1.3702 1.3862 1.3379 4.9021 8.5088 3.8377 3.7130 5.7119 1.2931 2.3597 5.0945 1.0528 2.2412 1.0641 1.8613 1.5323 8.9049 6.3513 6.2667 6.8831 1.0358 1.0608 1.1018 1.0991 1.1026 1.0853 1.0882 1.0925 1.0967 1.0879 1.1016 1.0921 1.0963
irintensity: 0.2592 0.1683 0.8198 0.7675 0.7274 0.3773 1.4081 2.0635 5.3598 1.2682 0.4297 0.6663 1.8441 1.2356 0.7290 1.4356 0.3625 1.9864 0.2960 0.7084 5.4963 4.8409 7.8909 5.2144 8.6479 10.9629 7.4589 2.3740 1.4970 6.7964 20.4302 33.3982 23.2721 4.5556 3.3476 6.1772 51.2824 12.0989 28.7050 0.1437 3.9337 10.0213 1.6940 1.4918 19.1683 1.5027 3.7196 2.2077 0.2658 9.9569 9.5138 17.3463 5.5060 54.8016 2.7679 17.9582 45.9076 1.3866 16.3693 433.8896 424.3738 136.2730 91.9943 12.8795 2.1211 34.2527 97.6389 55.1444 41.2748 21.8774 17.3534 31.7935 10.4428 8.6026 17.2196 30.0940 7.6255 107.8824 58.7321 34.8228 9.9154 130.0671 233.9345 18.8667 21.2630 0.8900 35.6748 26.2592 3.7872 1.1675 14.7657 19.5503 3.7024 17.4870 12.5881 7.9518
temp: 298.150 k
press: 1.00000 atm
elementType: 8 8 8 8 7 7 7 6 6 6 6 6 6 6 6 6 6 6 6 6 6 1 1 1 1 1 1 1 1 1 1 1 1 1
symmnumber: 1
zpe: 662248.9 jmol-1
zpe.correction: 0.252237 hartree
zpe.thermalcorrener: 0.270746 hartree
zpe.thermalcorrenthalpy: 0.271690 hartree
zpe.thermalcorrgfe: 0.204348 hartree
zpe.sumelectzpe: -1004.759643 hartree
zpe.sumelectthermal: -1004.741135 hartree
zpe.sumelectthermalent: -1004.740191 hartree
zpe.sumelectthermalfe: -1004.807533 hartree
dipole: -6.9715 6.0659 0.5249
dipole: 9.2560
quadrupole: -142.0122 -120.6167 -119.2989
quadrupole: 3.1920 -4.9641 -6.7237
quadrupole: -14.7029 6.6925 8.0104 3.1920 -4.9641 -6.7237
hfenergy: -1005.0118808 hartree
pointgroup: C01 [X(C14H13N3O4)]
dipole: -2.8901731 -1.4077312 1.7106376 debye
polarizability: 337.5275133|-32.6257046|143.2699212|-3.4388196|-30.8634733|178.0029505 unknown
InChI: InChI=1S/C14H13N3O4/c1-2-15(11-6-4-3-5-7-11)13-9-8-12(16(18)19)10-14(13)17(20)21/h3-10H,2H2,1H3
charge 0 multiplicity 1
34 atoms
O  0.277678 2.036432 -2.093343
O  -0.855092 2.347906 -0.136017
O  5.13135 -1.266403 0.285952
O  4.757646 0.239556 -1.39488
N  -1.157556 -0.285328 1.095456
N  -0.001517 1.716174 -0.872794
N  4.361319 -0.470987 -0.388375
C  0.195225 -0.242727 0.774336
C  -1.608524 -0.829915 2.409735
C  -2.192043 -0.049359 0.111317
C  0.751028 0.600278 -0.260464
C  1.134244 -1.08598 1.463616
C  -2.011269 -2.319523 2.356101
C  2.094321 0.502088 -0.662356
C  2.954016 -0.376193 0.017229
C  -2.108245 -0.676697 -1.157695
C  -3.312798 0.756815 0.426922
C  2.480898 -1.152603 1.105363
C  -3.139483 -0.491058 -2.103224
C  -4.345932 0.924677 -0.518173
C  -4.264771 0.303819 -1.786393
H  -0.814553 -0.651663 3.154493
H  -2.478163 -0.230557 2.729343
H  0.77755 -1.738077 2.263435
H  -2.829288 -2.475976 1.631656
H  -1.166458 -2.966251 2.060781
H  -2.366883 -2.648399 3.349259
H  2.472719 1.136259 -1.468489
H  3.176178 -1.815998 1.626501
H  -1.249949 -1.313438 -1.398306
H  -3.35284 1.288869 1.3826
H  -3.066637 -0.976512 -3.082255
H  -5.203241 1.560338 -0.272551
H  -5.064332 0.444631 -2.521083
