program: Gaussian 09
title: 000266830
version: EM64L-G09RevD.01
frameworkgroup: C1[X(C14H12O3)]
method: RPBEPBE
basis: SDD
operation: Freq
keyword: #pfreq=noraman
keyword: PBEPBE/SDD
title: #p freq=noraman PBEPBE/SDD
converged: YES YES NO NO
title: Mulliken charges:
elementType: O O O C C C C C C C C C C C C C C H H H H H H H H H H H H
charge: -0.265093 -0.440130 -0.225809 0.270711 0.360718 0.085412 -0.371580 -0.382317 -0.392396 -0.334166 0.321380 -0.355399 -0.363865 -0.230545 -0.234974 0.060767 -0.538502 0.235045 0.244563 0.254840 0.274998 0.239131 0.249263 0.232222 0.235705 0.224732 0.219875 0.245075 0.380339
chargesum: 0.00000
title: Mulliken charges with hydrogens summed into heavy atoms:
elementType: O O O C C C C C C C C C C C C C C
charge: -0.265093 -0.059791 -0.225809 0.270711 0.360718 0.085412 -0.136535 -0.137754 -0.137556 -0.059168 0.321380 -0.116268 -0.114602 0.001677 0.000730 0.060767 0.151180
polarizability: 2.59258161e+02 1.37851522e+01 1.60423357e+02 9.73876829e+00 -9.80312411e+00 9.15339950e+01
1716.lowfreq: -6.1688 -3.1108 -0.0008 -0.0006 -0.0005 7.5570 36.6130 47.7757 52.2196
frequency: 36.5761 47.7688 52.1933 88.0062 110.2524 134.4758 168.3984 216.1021 220.4701 243.8342 267.9592 316.1018 349.6177 399.5341 414.1152 435.5724 455.1769 508.4377 529.9152 554.3631 566.7911 590.9760 603.0849 631.2583 668.4174 695.6917 726.8631 749.5226 768.5476 787.9434 792.3166 811.5962 834.3525 891.6630 938.8525 959.5696 970.7741 984.1539 986.4680 991.5133 998.1789 1017.5310 1050.9760 1111.2469 1111.8019 1119.1821 1156.3771 1157.6196 1177.6213 1182.4387 1233.5684 1261.8384 1287.4819 1299.2442 1306.2326 1358.3766 1373.8888 1420.8978 1427.1048 1436.4525 1466.6807 1469.6531 1475.7809 1510.1144 1566.4457 1578.6594 1602.1963 1622.5275 1644.1571 2960.1307 3048.5941 3124.9700 3129.9941 3133.3091 3135.0315 3146.2263 3160.5129 3163.1616 3169.2629 3180.8264 3523.3837
redmass: 7.0647 4.9594 4.6997 4.3752 3.9936 4.6657 4.5818 2.7425 3.6285 1.6831 4.4080 4.3130 6.3491 4.3020 3.0093 4.4875 4.2587 3.6422 4.2515 3.0797 4.6083 1.4583 3.1339 6.5930 4.9099 4.2876 3.3989 5.1666 2.0230 2.3899 5.4138 1.3310 1.5533 1.4217 1.3592 1.3512 1.5176 5.3912 5.5756 5.5347 1.3492 2.7713 2.2312 1.4727 1.3446 1.4635 1.3387 1.7742 1.0676 1.2610 2.7534 1.7409 2.2474 2.2087 1.4160 4.3053 10.2539 3.5264 2.1282 1.2526 1.0541 1.6795 1.3101 2.8601 6.7132 7.2252 6.2278 6.4268 8.7019 1.0329 1.1040 1.0993 1.0861 1.0888 1.0886 1.0909 1.0967 1.0948 1.0959 1.0969 1.0640
irintensity: 0.6907 2.9181 0.5655 0.3102 2.3905 1.8413 5.1265 0.7542 2.3574 1.4073 1.4737 4.7101 3.1300 4.1445 1.9601 6.0837 1.8286 10.7633 9.4789 41.0260 10.3420 78.6585 45.4882 0.7025 6.1365 48.9028 11.4740 9.2291 59.7254 21.8797 5.4583 12.4358 51.9757 0.4269 0.1526 1.4343 40.3706 90.4978 185.7774 32.7456 0.8075 6.5434 19.4654 9.3636 2.8238 57.6094 3.8418 77.4998 1.1754 101.2917 194.5149 9.3972 37.4304 46.7212 4.8504 4.4591 10.0353 3.9021 13.1835 8.7679 16.5030 169.6373 2.2159 39.0834 13.8175 28.6780 11.6856 104.5346 250.8810 74.5385 47.2863 30.4812 5.5373 4.4146 13.3095 11.3463 20.8331 15.2125 5.7606 11.0496 36.9476
temp: 298.150 k
press: 1.00000 atm
elementType: 8 8 8 6 6 6 6 6 6 6 6 6 6 6 6 6 6 1 1 1 1 1 1 1 1 1 1 1 1
symmnumber: 1
zpe: 584967.3 jmol-1
zpe.correction: 0.222802 hartree
zpe.thermalcorrener: 0.237622 hartree
zpe.thermalcorrenthalpy: 0.238567 hartree
zpe.thermalcorrgfe: 0.179897 hartree
zpe.sumelectzpe: -765.159299 hartree
zpe.sumelectthermal: -765.144479 hartree
zpe.sumelectthermalent: -765.143535 hartree
zpe.sumelectthermalfe: -765.202205 hartree
dipole: -0.2594 0.1816 -1.8384
dipole: 1.8655
quadrupole: -80.8117 -86.5435 -101.5600
quadrupole: 6.9197 -6.0549 -4.4278
quadrupole: 8.8267 3.0949 -11.9216 6.9197 -6.0549 -4.4278
hfenergy: -765.3821017 hartree
pointgroup: C01 [X(C14H12O3)]
dipole: -0.1100861 0.1720021 0.7049635 debye
polarizability: 260.5916087|-10.5881072|144.9706235|-3.1779393|-29.6594987|105.6532805 unknown
InChI: InChI=1S/C14H12O3/c1-17-11-8-6-10(7-9-11)12-4-2-3-5-13(12)14(15)16/h2-9,15H,1H3
charge 0 multiplicity 1
29 atoms
O  4.536137 0.438651 -0.269342
O  -2.491884 -2.711464 1.045452
O  -0.574927 -2.429474 -0.222244
C  -1.200396 0.568561 -0.182191
C  0.288503 0.473003 -0.189145
C  -2.08067 -0.51034 0.162047
C  1.002346 -0.092185 0.896499
C  1.039196 1.025722 -1.264648
C  -1.788204 1.832201 -0.467011
C  -3.481134 -0.282183 0.26557
C  3.13697 0.418463 -0.173029
C  2.411333 -0.123994 0.917516
C  2.443664 0.995438 -1.266098
C  -3.180458 2.041074 -0.396708
C  -4.034429 0.982068 -0.010943
C  -1.5983 -1.917624 0.288452
C  5.29905 -0.178075 0.818685
H  0.451071 -0.501069 1.750516
H  0.512745 1.453638 -2.125486
H  -1.12632 2.670478 -0.709766
H  -4.124971 -1.120865 0.542776
H  2.925262 -0.56496 1.776601
H  3.022826 1.401474 -2.100737
H  -3.594236 3.030649 -0.620609
H  -5.115616 1.13771 0.064534
H  5.049716 -1.251558 0.926172
H  5.123047 0.34221 1.780496
H  6.353929 -0.069322 0.527024
H  -2.150451 -3.646124 1.037416
