program: Gaussian 09
title: 000266828
version: EM64L-G09RevD.01
frameworkgroup: C1[X(C14H11N3O5)]
method: RPBEPBE
basis: SDD
operation: Freq
keyword: #p
keyword: freq=noraman
keyword: PBEPBE/SDD
title: #p freq=noraman PBEPBE/SDD
converged: YES YES NO NO
title: Mulliken charges:
elementType: O O O O O N N N C C C C C C C C C C C C C C H H H H H H H H H H H
charge: -0.212483 -0.174024 -0.178247 -0.197105 -0.190103 -0.299182 0.011706 0.021136 0.304334 0.406553 0.323587 -0.310275 -0.522385 0.433638 0.179233 -0.402766 -0.374693 -0.287490 -0.207001 -0.226893 -0.766776 -0.237139 0.283125 0.332448 0.299199 0.248019 0.269366 0.232589 0.234679 0.272144 0.253774 0.245917 0.235116
chargesum: 0.00000
title: Mulliken charges with hydrogens summed into heavy atoms:
elementType: O O O O O N N N C C C C C C C C C C C C C C
charge: -0.212483 -0.174024 -0.178247 -0.197105 -0.190103 -0.299182 0.011706 0.021136 0.304334 0.406553 0.323587 -0.027150 -0.189937 0.433638 0.179233 -0.103567 -0.126674 -0.018124 0.025588 0.007786 0.005059 -0.002023
polarizability: 3.24312713e+02 -1.75443765e+00 1.89484450e+02 -1.61817868e+01 -5.18305758e+00 1.43944716e+02
1716.lowfreq: -41.9780 -11.6880 -6.0882 -3.2431 0.0004 0.0006 0.0009 31.9825 38.6189
frequency: -40.9346 31.5170 38.5861 43.6970 51.5536 60.5211 70.1651 85.4245 116.8228 146.1075 152.7626 166.4927 204.9647 242.2302 283.3810 308.9076 327.6709 341.8072 365.9583 404.4240 406.2386 447.7592 462.2947 496.2941 505.9555 516.1567 561.8742 580.7411 603.5174 615.0332 642.9925 650.6333 674.2494 692.2231 700.2885 711.4088 743.8293 756.9848 763.2305 840.1086 852.7904 857.1631 889.4741 916.1750 953.4967 959.3230 973.5639 989.6230 993.0152 996.1338 1002.1463 1028.7476 1031.7264 1057.8553 1089.9527 1110.9775 1139.3168 1175.4938 1181.1343 1193.1296 1201.5470 1209.9434 1244.9984 1255.4997 1295.9447 1325.5579 1358.6325 1374.2841 1383.6700 1385.0553 1393.4982 1420.4004 1441.7899 1445.8302 1462.3815 1469.9503 1479.4187 1576.6956 1592.7164 1599.3571 1602.6421 1623.8544 3001.4632 3091.3957 3128.6596 3132.2940 3141.4386 3153.6523 3160.4031 3169.3077 3185.8380 3187.9040 3196.5427
redmass: 1.3082 5.6791 7.2731 4.7347 6.2415 6.9442 8.6131 3.0864 6.6554 9.2121 6.1160 6.1267 5.7908 7.0590 7.7739 7.4220 7.5087 5.2310 5.6892 3.1736 4.0405 5.3828 5.3517 5.3368 5.9794 3.9471 4.1087 4.1833 5.1498 5.7926 7.4984 6.6167 7.3367 2.1856 6.0694 7.0930 4.9832 10.8651 1.7723 1.2545 1.4680 6.6437 4.4359 1.4803 1.6489 3.8351 1.3884 5.5843 1.4776 1.3275 1.7614 2.0121 1.6633 2.0075 1.5681 4.4185 1.3973 1.0514 2.4315 1.3906 8.0662 7.1065 1.8596 3.6111 3.1965 1.4062 5.7299 9.2828 7.1998 1.3087 10.3364 5.5881 2.2784 1.0841 1.0875 2.8593 2.2250 8.8815 6.4367 7.5436 6.1512 8.6189 1.0373 1.0978 1.0997 1.0859 1.0890 1.0942 1.0905 1.0997 1.0927 1.0959 1.0959
irintensity: 1.5988 0.7538 0.9852 1.4303 0.7205 2.4454 1.5720 3.2701 4.5843 3.8724 3.6833 0.3361 1.6101 0.3147 2.1817 2.1438 0.3129 0.4456 3.8838 1.6637 7.2893 4.1714 3.8180 2.4300 7.3623 24.4873 19.5945 2.5348 11.8806 2.5843 18.9762 1.9000 13.0659 36.0348 21.7321 8.6020 1.1730 24.4087 39.8403 1.3642 21.3742 7.1540 16.5612 2.8869 18.9296 2.5381 1.0816 3.8819 12.3288 0.6881 33.0582 10.8591 13.8250 28.0996 18.2401 4.9483 22.5768 0.2019 31.7569 129.4931 401.7701 289.5283 51.9574 337.4835 60.7721 5.6144 102.8489 61.1890 6.2652 37.8187 29.2065 21.6581 10.0059 24.3273 28.2875 76.8477 43.7473 44.6141 13.7874 286.9618 8.5591 67.6407 3.9176 7.0305 7.2540 2.1919 3.1716 21.8665 1.4530 25.6478 14.8307 7.6239 0.6350
temp: 298.150 k
press: 1.00000 atm
elementType: 8 8 8 8 8 7 7 7 6 6 6 6 6 6 6 6 6 6 6 6 6 6 1 1 1 1 1 1 1 1 1 1 1
symmnumber: 1
zpe: 609489.0 jmol-1
zpe.correction: 0.232142 hartree
zpe.thermalcorrener: 0.250800 hartree
zpe.thermalcorrenthalpy: 0.251744 hartree
zpe.thermalcorrgfe: 0.183146 hartree
zpe.sumelectzpe: -1078.736582 hartree
zpe.sumelectthermal: -1078.717924 hartree
zpe.sumelectthermalent: -1078.716980 hartree
zpe.sumelectthermalfe: -1078.785578 hartree
dipole: -1.0084 1.8965 -2.2291
dipole: 3.0956
quadrupole: -153.0171 -125.3853 -125.9452
quadrupole: 18.9030 1.7839 7.8327
quadrupole: -18.2346 9.3972 8.8374 18.9030 1.7839 7.8327
hfenergy: -1078.9687241 hartree
pointgroup: C01 [X(C14H11N3O5)]
dipole: -0.4187296 0.2319637 1.1198861 debye
polarizability: 322.6892139|20.9527608|156.9755633|10.7833028|-19.9380592|178.077101 unknown
InChI: InChI=1S/C14H11N3O5/c1-10(18)15(11-5-3-2-4-6-11)13-8-7-12(16(19)20)9-14(13)17(21)22/h2-9H,1H3
charge 0 multiplicity 1
33 atoms
O  -2.750129 -1.725334 2.061699
O  0.319028 -0.152519 -3.012378
O  -0.868021 -1.606089 -1.713262
O  5.113723 1.043529 0.958138
O  4.804659 0.792945 -1.292366
N  -1.123079 -0.52511 0.885815
N  0.025796 -0.693129 -1.87953
N  4.385352 0.769935 -0.072635
C  0.258654 -0.276038 0.624877
C  -2.094036 0.350072 0.248876
C  0.81297 -0.263512 -0.692754
C  1.127266 0.048872 1.701917
C  2.149905 0.096364 -0.934699
C  2.9689 0.402642 0.166885
C  -1.546752 -1.612143 1.71419
C  2.47654 0.373575 1.491381
C  -1.84101 1.743669 0.217671
C  -3.26517 -0.177398 -0.347188
C  -2.759779 2.609793 -0.413201
C  -4.182764 0.698791 -0.962055
C  -0.490816 -2.642126 2.097579
C  -3.935256 2.091088 -1.002121
H  0.705435 0.086405 2.710794
H  2.547548 0.120385 -1.952727
H  3.1426 0.633012 2.318185
H  -0.942704 2.150391 0.69497
H  -3.452206 -1.252509 -0.330635
H  -2.561122 3.686598 -0.434267
H  -5.088136 0.28982 -1.422566
H  -1.021429 -3.556785 2.401593
H  0.189685 -2.872041 1.260264
H  0.118843 -2.305703 2.95467
H  -4.650395 2.763551 -1.487518
