program: Gaussian 09
title: 000266827
version: EM64L-G09RevD.01
frameworkgroup: C1[X(C14H8N2)]
method: RPBEPBE
basis: SDD
operation: Freq
keyword: #pfreq=noraman
keyword: PBEPBE/SDD
title: #p freq=noraman PBEPBE/SDD
converged: YES YES NO NO
title: Mulliken charges:
elementType: N N C C C C C C C C C C C C C C H H H H H H H H
charge: -0.015651 -0.015651 0.249503 0.249500 0.227507 0.227509 -0.363543 -0.363543 -0.377092 -0.377091 -0.225966 -0.225966 -0.222177 -0.222178 -0.283867 -0.283867 0.263999 0.263999 0.261397 0.261397 0.242224 0.242224 0.243666 0.243666
chargesum: 0.00000
title: Mulliken charges with hydrogens summed into heavy atoms:
elementType: N N C C C C C C C C C C C C C C
charge: -0.015651 -0.015651 0.249503 0.249500 0.227507 0.227509 -0.099544 -0.099544 -0.115695 -0.115694 0.016258 0.016258 0.021489 0.021488 -0.283867 -0.283867
polarizability: 2.03644037e+02 -1.77942960e+01 1.81409402e+02 1.09441421e-04 5.56556306e-05 8.97520827e+01
1716.lowfreq: -8.3811 -6.8189 -0.0008 -0.0006 -0.0004 3.2159 42.4926 69.9110 78.2303
frequency: 42.4926 69.9102 78.2285 133.2150 133.4392 154.2097 175.8988 270.6279 276.5470 323.5170 380.8509 387.8136 449.3835 458.7248 523.1784 530.4542 560.4184 567.2893 574.8528 595.0904 621.5205 682.3273 740.2665 751.5980 766.8849 775.6672 781.3541 800.0975 889.2830 895.5056 968.0671 970.4405 993.3693 1001.7099 1001.7954 1044.7360 1046.8372 1104.9759 1113.0192 1181.3716 1182.1001 1193.1045 1198.5208 1260.4272 1267.1584 1308.3548 1357.0483 1364.9504 1419.0764 1440.1483 1462.6761 1494.4378 1563.4665 1575.1918 1601.3060 1605.1712 2173.8332 2174.1509 3141.9093 3141.9304 3152.4760 3152.5023 3163.8303 3163.9583 3176.9275 3177.1224
redmass: 8.5117 5.3913 5.9549 5.9057 5.7223 7.2069 6.6464 5.2531 7.2133 6.3561 4.1662 4.2968 5.0184 8.7121 6.5846 4.6028 5.9530 4.4626 4.0876 6.2433 7.0636 5.8463 3.1467 6.0647 3.7784 1.4233 1.3415 5.8429 1.3486 1.4245 1.3786 1.3924 6.9754 1.3610 1.3441 2.3469 2.4489 2.3449 1.7640 1.0848 1.1054 2.4406 2.6732 1.9890 1.4346 1.6750 9.8541 11.1360 1.9649 2.4109 2.3801 2.9982 6.1717 6.9182 5.9390 6.2468 12.6378 12.6370 1.0860 1.0860 1.0900 1.0901 1.0952 1.0954 1.1012 1.1012
irintensity: 3.6984 2.7198 4.0545 2.4243 0.0999 0.2410 3.9643 0.2696 0.1723 0.1084 0.0382 0.2407 4.4343 0.8058 3.6923 2.5956 2.3172 5.5145 0.1922 1.5250 4.0969 1.5984 19.9935 5.6331 2.4039 119.7065 22.7582 0.4575 0.7924 0.3118 3.7889 0.6592 4.4188 0.2897 0.0057 0.4377 5.2196 1.2828 5.9121 0.0886 0.0612 0.5825 4.4104 0.3791 0.3857 0.1012 10.7556 0.0830 9.3195 1.6978 38.4061 0.5110 2.1678 0.1888 7.5895 1.9354 9.4256 33.5291 0.0925 0.5335 10.8387 0.3061 18.1428 3.1282 27.4093 1.7581
temp: 298.150 k
press: 1.00000 atm
elementType: 7 7 6 6 6 6 6 6 6 6 6 6 6 6 6 6 1 1 1 1 1 1 1 1
symmnumber: 1
zpe: 458939.8 jmol-1
zpe.correction: 0.174801 hartree
zpe.thermalcorrener: 0.187590 hartree
zpe.thermalcorrenthalpy: 0.188534 hartree
zpe.thermalcorrgfe: 0.134877 hartree
zpe.sumelectzpe: -646.711445 hartree
zpe.sumelectthermal: -646.698656 hartree
zpe.sumelectthermalent: -646.697712 hartree
zpe.sumelectthermalfe: -646.751369 hartree
dipole: 0.0000 0.0000 -3.7726
dipole: 3.7726
quadrupole: -66.1746 -108.7274 -97.5707
quadrupole: -6.5012 0.0000 0.0001
quadrupole: 24.6496 -17.9031 -6.7465 -6.5012 0.0000 0.0001
hfenergy: -646.8862455 hartree
pointgroup: C01 [X(C14H8N2)]
dipole: 0.0004451 -0.0007006 1.484252 debye
dipolederiv: -0.242979 -0.0181518 0.0194912 -0.0125886 -0.3630154 0.0726257 -0.0203039 0.0711405 -0.2752174 -0.2429761 -0.0181777 -0.0195284 -0.0126468 -0.3628825 -0.0727016 0.020275 -0.0712135 -0.2753537 0.2636557 -0.0793987 0.0322826 0.1138484 0.0320335 -0.0744979 0.0055286 -0.0295763 0.0040076 0.2636344 -0.0793525 -0.0325126 0.1138967 0.0319329 0.0744567 -0.0055728 0.0296529 0.0041306 0.0510729 -0.1165881 0.037691 -0.1229701 0.0018674 0.0534008 -0.0066703 0.0206535 0.0838889 0.0510564 -0.1165616 -0.0377818 -0.1230067 0.001936 -0.0534082 0.0065694 -0.0206662 0.0838348 -0.2359251 -0.102625 0.0736771 -0.1326124 -0.0031296 -0.0535958 0.0735894 -0.0211307 -0.0924847 -0.2360139 -0.102542 -0.0736894 -0.1325116 -0.0032028 0.0537599 -0.0736316 0.0212768 -0.0923264 -0.0663836 0.0509284 -0.0143643 -0.1227247 0.0124072 -0.0611662 0.0927567 -0.0701762 -0.0970755 -0.0664306 0.0509568 0.0143922 -0.1226006 0.0122827 0.0613456 -0.0928925 0.0702522 -0.0969016 0.0839956 0.0571852 -0.0269551 0.041161 0.0837938 -0.0913527 -0.0234373 -0.0849493 -0.079148 0.0840244 0.0572095 0.0269109 0.0411933 0.0836261 0.0914835 0.0233777 0.0850699 -0.0790102 0.0926539 0.0329648 -0.0034812 0.116593 -0.1495648 0.0004325 -0.0479239 0.0054194 -0.1433517 0.0926845 0.0329618 0.0033711 0.1165487 -0.1495595 -0.0005081 0.0478942 -0.0054454 -0.1433874 0.0376778 0.1289767 -0.060912 0.0743548 0.2626811 -0.1350991 -0.002735 -0.1124235 0.0945283 0.0377101 0.1289867 0.0610691 0.0744298 0.2624527 0.1352151 0.0028389 0.1125069 0.0947242 0.0351529 0.0725846 -0.0450303 0.0658764 0.0217353 0.0532762 -0.0531269 0.0417639 0.114797 0.0352104 0.0725167 0.0451473 0.0657954 0.0218257 -0.053404 0.0532365 -0.0418959 0.1146479 0.0362247 0.0515251 -0.0244367 0.0753167 0.0236537 0.0654032 -0.0311683 0.0641019 0.1272622 0.0362573 0.0514638 0.0245412 0.0752477 0.0237777 -0.0655471 0.0312959 -0.0642309 0.1271051 0.0457068 -0.0509155 0.0281198 -0.0774549 -0.0191031 0.0836827 0.0334191 0.0763692 0.114168 0.0456712 -0.0509334 -0.0281264 -0.0774729 -0.0189513 -0.0837634 -0.0334502 -0.076465 0.1140526 -0.1008377 -0.0265021 0.0098321 -0.0188262 0.096673 0.0311352 -0.0002571 0.028875 0.1485807 -0.1008433 -0.0265116 -0.0097072 -0.0188464 0.0967303 -0.0311731 0.0003885 -0.0289092 0.1485287 unknown
polarizability: 205.6392538|16.3796627|179.414159|-0.0271209|0.0376326|89.7521087 unknown
InChI: InChI=1S/C14H8N2/c15-9-11-5-1-3-7-13(11)14-8-4-2-6-12(14)10-16/h1-8H
charge 0 multiplicity 1
24 atoms
N  -0.676467 3.17941 -1.174775
N  0.675577 -3.17807 -1.178184
C  -0.743813 -0.068474 0.428921
C  0.743883 0.068284 0.428542
C  -1.598685 0.965381 -0.077409
C  1.598459 -0.965081 -0.079285
C  -1.354503 -1.234772 0.95575
C  1.354881 1.234083 0.956116
C  -3.012811 0.81469 -0.038561
C  3.012607 -0.814414 -0.041146
C  -2.756949 -1.380417 0.991611
C  2.757347 1.379706 0.991275
C  -3.591091 -0.35284 0.495176
C  3.591199 0.352611 0.493356
C  -1.069704 2.168013 -0.671263
C  1.06913 -2.167154 -0.673955
H  -0.721646 -2.031412 1.358879
H  0.722262 2.030337 1.360381
H  -3.642364 1.615374 -0.438786
H  3.641925 -1.614711 -0.442514
H  -3.195432 -2.293229 1.407533
H  3.196072 2.292125 1.407803
H  -4.679936 -0.462089 0.519503
H  4.680058 0.461846 0.517133
