program: Gaussian 09
title: 000266821
version: EM64L-G09RevD.01
frameworkgroup: C1[X(C13H9ClN2O5)]
method: RPBEPBE
basis: SDD
operation: Freq
keyword: #p
keyword: freq=noraman
keyword: PBEPBE/SDD
title: #p freq=noraman PBEPBE/SDD
converged: YES YES NO NO
title: Mulliken charges:
elementType: Cl O O O O O N N C C C C C C C C C C C C C H H H H H H H H H
charge: 0.059777 -0.255566 -0.180564 -0.182350 -0.190025 -0.169604 0.006438 0.006840 0.259347 0.313807 0.256481 -0.331652 -0.507201 -0.358497 -0.334258 0.568838 -0.389333 -0.356037 -0.367239 0.328601 -0.536998 0.295825 0.319616 0.253250 0.271824 0.259632 0.249969 0.226291 0.230702 0.252087
chargesum: 0.00000
title: Mulliken charges with hydrogens summed into heavy atoms:
elementType: Cl O O O O O N N C C C C C C C C C C C C C
charge: 0.059777 -0.255566 -0.180564 -0.182350 -0.190025 -0.169604 0.006438 0.006840 0.259347 0.313807 0.256481 -0.035827 -0.187585 -0.105248 -0.062434 0.568838 -0.389333 -0.096406 -0.117270 0.328601 0.172083
polarizability: 3.79364170e+02 4.58588381e+00 1.95306478e+02 8.04307162e+00 -1.15626326e+01 1.05184859e+02
1716.lowfreq: -3.9532 -2.8003 -0.0011 -0.0006 0.0015 3.0566 26.8675 39.1451 42.5209
frequency: 26.8546 39.1368 42.5200 49.8158 53.5069 88.7860 112.2296 137.6644 160.5058 177.8016 184.6189 207.5817 223.0567 242.6223 262.0660 294.0199 304.8484 327.1852 378.9144 384.1297 418.2523 437.4797 478.1609 504.6822 508.7001 551.4773 583.0665 598.2415 602.5707 633.9974 664.4541 695.1692 718.7470 722.5117 734.4273 748.2128 754.2646 784.5364 815.4606 835.7703 887.9802 892.2136 929.3404 945.3181 964.7524 980.4771 996.4414 1027.3931 1096.4388 1111.9556 1119.5014 1131.8889 1158.5563 1186.2260 1199.3812 1217.4042 1247.2825 1259.3866 1267.2058 1298.5530 1320.3185 1365.1182 1372.3252 1383.5217 1394.0633 1428.6846 1436.2345 1451.6887 1470.0498 1472.1584 1502.5479 1538.7433 1563.7002 1591.6161 1617.6322 2970.1183 3062.8858 3135.2107 3136.1573 3163.0455 3170.4484 3173.5893 3184.4573 3201.5037
redmass: 8.4135 10.8062 13.3253 6.4803 5.4909 7.8483 4.4912 6.3300 7.8598 5.0393 6.0139 6.7362 7.9251 1.3055 5.7324 11.4325 7.0629 6.9471 7.9665 8.9769 3.0567 4.1042 4.4799 4.0567 7.9792 5.8967 3.9735 6.9661 7.9139 7.3425 7.4355 7.5927 5.6418 7.2406 5.0483 5.0799 10.4925 6.2334 1.2793 1.6114 1.4706 8.7446 1.5401 1.3424 1.3415 8.6061 3.7897 3.9294 3.4501 1.2589 1.4370 2.4728 1.3231 1.3893 8.5936 9.0018 2.7705 1.2337 4.2848 1.9304 2.1747 5.8459 10.6318 12.5868 9.8167 3.9239 1.2290 2.5162 1.0507 1.0854 2.7334 9.7800 6.9422 7.6904 6.3458 1.0326 1.1045 1.1001 1.0896 1.0896 1.0921 1.0955 1.0921 1.0946
irintensity: 0.3112 0.4802 0.7056 2.0578 1.3931 2.6767 5.9583 2.1084 1.4131 2.5717 2.2212 4.6466 5.4892 0.1852 0.7875 0.9984 1.6662 1.5987 0.4628 0.8746 9.3527 2.4032 3.4437 4.8194 29.0357 37.3720 11.4224 7.9668 2.7020 1.1466 3.7249 24.5478 4.0843 4.6761 11.9478 5.2011 17.3857 1.1963 21.4348 69.5628 8.2063 57.5715 22.4113 2.3820 3.1140 52.8571 6.5531 52.6574 4.2239 0.1374 9.5499 4.9501 8.9428 395.4113 318.4529 229.6215 193.0470 0.9004 127.9014 4.5755 0.6938 11.6982 105.4914 75.8406 49.5463 1.4000 33.4988 119.7993 15.7875 43.9388 40.1339 68.5624 47.9594 352.0588 193.5602 75.8648 39.0726 23.7373 4.4581 9.7129 0.3738 4.2302 16.0713 2.4796
temp: 298.150 k
press: 1.00000 atm
elementType: 17 8 8 8 8 8 7 7 6 6 6 6 6 6 6 6 6 6 6 6 6 1 1 1 1 1 1 1 1 1
symmnumber: 1
zpe: 529416.7 jmol-1
zpe.correction: 0.201644 hartree
zpe.thermalcorrener: 0.220293 hartree
zpe.thermalcorrenthalpy: 0.221238 hartree
zpe.thermalcorrgfe: 0.152437 hartree
zpe.sumelectzpe: -1444.778913 hartree
zpe.sumelectthermal: -1444.760263 hartree
zpe.sumelectthermalent: -1444.759319 hartree
zpe.sumelectthermalfe: -1444.828120 hartree
dipole: -7.0965 -2.7639 -1.6034
dipole: 7.7827
quadrupole: -128.3758 -139.4430 -124.7333
quadrupole: -1.2398 6.7763 -3.7448
quadrupole: 2.4749 -8.5923 6.1174 -1.2398 6.7763 -3.7448
hfenergy: -1444.9805567 hartree
pointgroup: C01 [X(C13H9Cl1N2O5)]
dipole: 2.795664 -1.1769057 0.417881 debye
polarizability: 378.1507|-5.0999867|179.666533|19.7821732|35.7661594|122.0382735 unknown
InChI: InChI=1S/C13H9ClN2O5/c1-21-9-4-2-8(3-5-9)10-6-11(14)13(16(19)20)7-12(10)15(17)18/h2-7H,1H3
charge 0 multiplicity 1
30 atoms
Cl -3.104924 -2.958785 -0.727098
O  5.444781 -0.883026 -0.346528
O  -0.992774 3.371657 0.049233
O  0.573327 2.421912 1.408253
O  -5.14159 0.82853 0.547054
O  -5.21389 -0.905047 -0.937452
N  -0.432371 2.349787 0.605424
N  -4.581704 -0.092833 -0.16642
C  -0.219782 -0.14635 0.052946
C  1.265813 -0.250632 0.013214
C  -1.013817 1.017247 0.310966
C  -0.953496 -1.318194 -0.293829
C  -2.416911 1.001582 0.227684
C  1.861603 -0.82872 -1.150416
C  2.118588 0.096021 1.095614
C  -3.101278 -0.181256 -0.103249
C  -2.355946 -1.359721 -0.369719
C  3.247199 -1.013972 -1.245279
C  3.510525 -0.111117 1.022646
C  4.082983 -0.654771 -0.154874
C  6.364935 -0.507856 0.735504
H  -0.395289 -2.240594 -0.475693
H  -2.990173 1.914726 0.40821
H  1.22941 -1.097434 -2.0044
H  1.691532 0.505793 2.011727
H  3.707133 -1.428386 -2.146925
H  4.131196 0.1569 1.882042
H  6.159498 -1.089667 1.654177
H  6.30198 0.574993 0.953724
H  7.366244 -0.754488 0.355063
