program: Gaussian 09
title: 000266820
version: EM64L-G09RevD.01
frameworkgroup: C1[X(C13H9ClN2O4)]
method: RPBEPBE
basis: SDD
operation: Freq
keyword: #p
keyword: freq=noraman
keyword: PBEPBE/SDD
title: #p freq=noraman PBEPBE/SDD
converged: YES YES NO NO
title: Mulliken charges:
elementType: Cl O O O O N N C C C C C C C C C C C C C H H H H H H H H H
charge: 0.037111 -0.159560 -0.143035 -0.190568 -0.163424 -0.007424 0.001462 0.175962 0.337751 0.417287 0.240632 -0.358939 -0.368392 0.439190 -0.345382 -0.377474 -0.372673 -0.375167 -0.215543 -0.803797 0.239727 0.256084 0.287395 0.235932 0.236669 0.276195 0.229522 0.228851 0.241608
chargesum: 0.00000
title: Mulliken charges with hydrogens summed into heavy atoms:
elementType: Cl O O O O N N C C C C C C C C C C C C C
charge: 0.037111 -0.159560 -0.143035 -0.190568 -0.163424 -0.007424 0.001462 0.175962 0.337751 0.417287 0.240632 -0.119212 -0.112308 0.439190 -0.345382 -0.090080 -0.136741 -0.138499 0.060652 -0.103816
polarizability: 2.55334599e+02 -7.39760895e+00 1.87641058e+02 -5.26794575e-01 1.64380999e+01 1.19940897e+02
1716.lowfreq: -0.0024 -0.0015 -0.0011 4.5849 5.6647 7.0046 38.3094 40.4908 43.9211
frequency: 38.2489 40.4775 43.8701 44.8945 57.4040 62.3739 81.6770 119.0200 143.0396 157.3302 164.2768 211.1673 236.8288 266.1416 289.7018 298.5618 346.0429 366.8700 395.3470 402.4024 405.1609 492.0551 503.4087 554.0893 564.8882 567.9819 611.4138 637.6366 676.6443 686.9737 698.4050 718.2473 747.7296 750.2864 766.4845 807.9906 827.6624 831.3808 849.0697 869.3776 956.9187 964.4044 976.4738 990.4861 1004.6912 1032.3185 1048.0129 1122.1161 1129.6090 1142.0679 1172.3323 1199.7526 1218.6765 1226.5483 1244.6728 1264.4040 1310.7707 1352.5230 1365.0843 1370.0594 1397.1112 1399.5003 1401.4128 1410.8038 1432.6242 1469.1474 1474.3839 1509.2035 1556.2339 1575.8444 1589.5200 1622.5800 2978.8287 3061.0250 3090.5712 3123.0985 3129.6439 3145.6328 3156.0391 3174.2150 3191.2538
redmass: 3.5952 8.6620 1.2196 7.0517 6.3635 6.9640 10.4506 5.6624 11.2859 5.3293 12.4285 9.2441 8.8444 5.7439 6.7452 13.2603 3.0964 6.0683 5.4716 2.9514 5.9383 5.0638 4.7232 6.2714 5.3705 5.0685 7.6810 7.0806 8.2746 7.9716 7.5870 3.8841 6.3367 8.2149 6.4678 3.3620 1.8537 1.4895 1.2515 8.1933 1.3130 1.3550 1.3820 1.4010 4.7511 3.6138 1.5776 8.6049 1.3532 1.4313 2.0655 1.1237 8.7479 2.9189 8.9185 3.3339 1.3078 4.4122 8.4867 8.1853 13.1358 1.2392 6.0322 3.2791 2.8972 1.0991 1.0561 2.8466 7.2231 6.1316 9.3332 6.3459 1.0389 1.0947 1.1000 1.0875 1.0884 1.0969 1.0970 1.0893 1.0978
irintensity: 1.3816 1.8134 0.7839 1.0024 0.6705 0.6478 2.3726 0.3464 4.2719 1.0141 0.4687 0.5627 0.6352 0.3276 2.5828 0.7820 0.8172 3.2394 5.1740 1.6639 4.9403 5.3747 10.8490 14.8784 14.7147 1.8406 1.6243 0.2632 10.6121 16.3528 11.7812 1.9447 2.7635 3.3077 23.9398 16.4053 24.1660 32.1548 1.8370 42.5202 1.1014 1.5735 0.3611 0.2012 3.9272 31.5317 20.0017 5.0301 9.5710 3.8326 34.4749 7.2108 221.9658 3.6174 31.4476 15.4303 3.1860 5.3670 14.5195 74.0758 132.2070 18.9223 58.2727 3.9457 66.4637 14.1831 12.9775 7.5542 46.4696 3.4484 50.7424 27.6767 27.6501 19.5545 15.8061 7.9079 14.0678 16.5068 2.6278 0.6821 1.3173
temp: 298.150 k
press: 1.00000 atm
elementType: 17 8 8 8 8 7 7 6 6 6 6 6 6 6 6 6 6 6 6 6 1 1 1 1 1 1 1 1 1
symmnumber: 1
zpe: 516267.3 jmol-1
zpe.correction: 0.196636 hartree
zpe.thermalcorrener: 0.214778 hartree
zpe.thermalcorrenthalpy: 0.215722 hartree
zpe.thermalcorrgfe: 0.147830 hartree
zpe.sumelectzpe: -1369.652345 hartree
zpe.sumelectthermal: -1369.634204 hartree
zpe.sumelectthermalent: -1369.633259 hartree
zpe.sumelectthermalfe: -1369.701151 hartree
dipole: -0.5201 0.5566 0.2462
dipole: 0.8005
quadrupole: -98.7470 -139.1881 -121.9661
quadrupole: -16.4004 2.7423 3.5174
quadrupole: 21.2201 -19.2210 -1.9990 -16.4004 2.7423 3.5174
hfenergy: -1369.8489812 hartree
pointgroup: C01 [X(C13H9Cl1N2O4)]
dipole: -0.229748 -0.1733826 -0.1278712 debye
polarizability: 256.1410158|0.9734752|177.5021929|-1.8818077|28.3314791|129.2733458 unknown
InChI: InChI=1S/C13H9ClN2O4/c1-8-2-4-9(5-3-8)12-11(15(17)18)7-6-10(14)13(12)16(19)20/h2-7H,1H3
charge 0 multiplicity 1
29 atoms
Cl -4.085454 1.89909 0.466921
O  -0.973444 2.59424 1.643272
O  -0.744467 2.806886 -0.622195
O  -0.650275 -3.680821 -1.135137
O  0.75409 -2.862407 0.468919
N  -1.048182 2.151673 0.438519
N  -0.276819 -2.772906 -0.293572
C  -0.590938 -0.283671 0.064626
C  0.874186 0.004577 0.040721
C  -1.540631 0.755152 0.25446
C  -1.147499 -1.570492 -0.173789
C  1.627795 -0.266592 -1.129862
C  1.529511 0.561877 1.167498
C  3.675564 0.567802 -0.04527
C  -2.93242 0.532834 0.220149
C  -2.535819 -1.809924 -0.254016
C  3.007342 0.013261 -1.168035
C  2.912174 0.830854 1.121063
C  -3.440043 -0.753735 -0.045033
C  5.156665 0.892321 -0.099851
H  1.133397 -0.685068 -2.014456
H  0.968427 0.758249 2.087321
H  -2.891602 -2.821476 -0.464852
H  3.574136 -0.199875 -2.081858
H  3.406236 1.248839 2.005886
H  -4.519265 -0.920394 -0.08432
H  5.631384 0.788789 0.891444
H  5.690434 0.233882 -0.806938
H  5.319119 1.935535 -0.434016
