program: Gaussian 09
title: 000266810
version: EM64L-G09RevD.01
frameworkgroup: C1[X(C12H7ClN2O4)]
method: RPBEPBE
basis: SDD
operation: Freq
keyword: #p
keyword: freq=noraman
keyword: PBEPBE/SDD
title: #p freq=noraman PBEPBE/SDD
converged: YES YES NO NO
title: Mulliken charges:
elementType: Cl O O O O N N C C C C C C C C C C C C H H H H H H H
charge: -0.037005 -0.179068 -0.174633 -0.194639 -0.187115 0.011470 0.024606 0.238825 0.456330 0.276536 -0.315226 -0.503217 0.420576 -0.390683 -0.312193 -0.364983 -0.211720 -0.230727 -0.219092 0.270703 0.331608 0.296030 0.250823 0.262190 0.239001 0.241603
chargesum: 0.00000
title: Mulliken charges with hydrogens summed into heavy atoms:
elementType: Cl O O O O N N C C C C C C C C C C C C
charge: -0.037005 -0.179068 -0.174633 -0.194639 -0.187115 0.011470 0.024606 0.238825 0.456330 0.276536 -0.044523 -0.171609 0.420576 -0.094653 -0.312193 -0.114161 0.050470 0.008274 0.022511
polarizability: 2.65613693e+02 -9.51400463e+00 1.65729266e+02 -1.44439927e+01 9.20186861e+00 1.02139027e+02
1716.lowfreq: -6.1564 -5.4529 -0.0003 0.0015 0.0020 1.2214 32.7515 43.2708 56.2588
frequency: 32.6945 43.2546 56.2507 58.4992 82.9990 127.8398 141.3030 150.3065 152.5970 216.0308 245.2422 276.4410 317.0443 343.3860 360.1250 407.1428 414.5875 446.9358 468.4331 500.4143 530.2219 544.0548 591.5933 630.1547 649.2141 666.6769 679.2025 712.3409 726.1910 738.5085 750.8881 758.8338 766.6409 857.6074 866.9036 872.9702 952.1979 957.2571 987.7176 990.1409 994.5740 1024.2851 1048.4599 1075.7315 1108.3045 1126.6957 1141.9373 1175.8004 1206.5322 1218.7207 1243.9411 1261.2051 1288.2356 1353.5957 1365.6165 1377.5690 1391.4790 1414.1320 1422.0847 1450.9717 1486.3676 1567.8081 1584.2770 1603.5501 1607.8913 3138.5168 3150.1921 3160.6666 3166.6491 3179.9257 3188.3603 3190.5948
redmass: 10.8967 9.0602 11.5654 9.8563 7.6236 8.3023 7.2100 8.7696 7.1987 8.0689 6.8653 9.1446 7.7509 8.9957 6.6892 10.6236 3.7779 4.4244 5.0264 9.0225 4.9588 3.8732 5.0937 7.2619 7.7865 7.0296 9.6305 5.5871 4.7648 6.2298 3.2204 10.9745 1.4912 1.3869 7.3912 1.4262 1.3774 1.4624 4.2836 1.5135 1.3820 5.1675 2.2701 1.7109 4.0054 1.7999 1.4142 1.0585 9.3644 9.3900 1.7541 1.3968 2.2427 4.2007 8.5264 11.6016 10.3859 6.0807 2.3080 2.3863 3.3677 6.1245 8.9706 7.1457 7.4845 1.0869 1.0903 1.0904 1.0952 1.1000 1.0949 1.0934
irintensity: 0.2595 0.3681 0.2031 0.6164 0.8873 0.8753 2.4558 3.3857 4.0877 0.8832 3.0789 0.1384 0.2574 2.3152 0.6613 3.9782 1.4037 8.7510 4.8706 1.2207 4.3304 7.4041 4.8759 1.5546 11.0644 3.0841 31.8796 11.8016 0.9270 15.7203 13.6856 19.0174 82.0613 16.8874 16.4621 7.2838 1.8178 24.6121 12.6353 1.1938 0.1462 26.9513 10.4410 28.8505 5.7879 0.6559 13.9846 0.5956 364.1181 115.8690 24.4391 5.6887 8.5670 20.7596 20.3878 90.6958 66.9685 61.0739 12.9968 45.6464 3.8564 5.3624 10.4360 2.1507 75.9535 1.4288 7.8241 2.0113 10.4560 11.8237 4.2266 18.0252
temp: 298.150 k
press: 1.00000 atm
elementType: 17 8 8 8 8 7 7 6 6 6 6 6 6 6 6 6 6 6 6 1 1 1 1 1 1 1
symmnumber: 1
zpe: 447316.7 jmol-1
zpe.correction: 0.170374 hartree
zpe.thermalcorrener: 0.186268 hartree
zpe.thermalcorrenthalpy: 0.187212 hartree
zpe.thermalcorrgfe: 0.125107 hartree
zpe.sumelectzpe: -1330.438516 hartree
zpe.sumelectthermal: -1330.422622 hartree
zpe.sumelectthermalent: -1330.421678 hartree
zpe.sumelectthermalfe: -1330.483783 hartree
dipole: 4.7214 -5.0793 0.0298
dipole: 6.9348
quadrupole: -124.3067 -117.4767 -115.7133
quadrupole: -6.2183 2.2467 6.1040
quadrupole: -5.1411 1.6888 3.4523 -6.2183 2.2467 6.1040
hfenergy: -1330.6088901 hartree
pointgroup: C01 [X(C12H7Cl1N2O4)]
dipole: 1.9228929 1.6753926 0.9692941 debye
dipolederiv: -0.2203695 -0.0549292 -0.2105386 -0.0483424 -0.0749261 -0.1191883 -0.1296118 -0.1133435 -0.5785913 -0.4268435 -0.0038053 -0.1414196 -0.0961661 -0.6556919 -0.2144375 -0.1714506 -0.1610048 -0.355524 -0.6627171 0.0647611 -0.2128204 0.1006012 -0.5087129 -0.0062823 -0.1791391 -0.0770651 -0.3215088 -0.7747404 0.2192967 0.0420903 0.2302963 -0.6303209 -0.1026035 0.0461765 -0.1033149 -0.2428067 -0.7881907 -0.1484798 -0.0544946 -0.1964031 -0.5803814 -0.0938345 -0.0743967 -0.1041376 -0.2367524 0.9349012 -0.264834 0.3695341 -0.2240649 1.2307776 0.3001733 0.3259282 0.3160235 0.5170462 1.9881221 -0.1010678 0.0199643 -0.0523233 0.9870352 0.207045 0.0509486 0.2116464 0.2402611 0.7052642 0.1210185 -0.048233 -0.0466989 0.1531023 -0.0012408 -0.0838532 0.0987564 0.0152305 -0.1154501 0.0029211 -0.0709037 0.0940058 0.0592124 -0.0408672 -0.114848 -0.0833536 -0.2021767 -0.2787477 0.1171136 -0.0234197 0.0362327 -0.2293969 -0.0878182 -0.1028283 -0.0793841 0.0227769 -0.4967615 0.1816793 0.0402809 0.2729046 0.0170847 0.0288263 0.1600744 0.0344407 -0.096926 0.1452643 -0.0924159 -0.0235184 -0.2107127 -0.0483529 0.0202436 -0.0104716 -0.0398425 -0.0609683 -0.7194928 0.0460658 0.0118401 -0.0328919 -0.0660674 -0.0376317 -0.0302015 -0.0424998 0.0546308 0.2851529 -0.0958099 -0.0174868 0.2192562 0.0001179 0.0319613 0.105231 0.018868 -0.0765008 0.2608061 0.0825863 0.3814494 -0.098611 -0.006767 0.2333942 0.1148319 0.182156 0.8371413 -0.0059164 -0.0025687 -0.0065184 0.1624863 -0.1143281 0.0076108 0.0983683 0.0330729 0.0577784 -0.1685233 -0.0387259 -0.1747101 -0.0405038 -0.1005649 -0.0273412 -0.1449576 -0.0147837 -0.1575517 -0.1323643 0.0290234 0.0929032 -0.0178405 -0.1330552 0.0425817 0.1215899 0.0555311 0.0440193 0.127397 0.0066782 -0.0195431 0.0089267 -0.1282293 0.0409793 0.0104146 0.0462378 0.0429088 0.0522122 -0.0681371 -0.0246671 -0.0737883 0.0174759 -0.0209189 -0.0085434 -0.037259 0.1236037 0.1593976 -0.0200524 0.006308 0.0024727 0.1368511 -0.0099018 -0.0176523 0.0025449 0.1711879 0.1123179 0.0460509 0.0125703 0.0217534 0.0850459 -0.0210628 -0.0211062 -0.0161786 0.1621278 0.044632 0.0188567 0.0835742 0.017339 0.1315207 -0.0285525 0.087818 -0.0216814 -0.0095822 0.0513721 0.0017168 0.0455409 0.0238968 0.1572851 -0.0298119 0.0615049 -0.030506 0.009828 0.0279233 -0.0252099 -0.0645857 -0.0365559 0.1470835 -0.0509962 -0.0842384 -0.0570247 -0.0439198 -0.1046455 -0.0217325 -0.0131964 -0.015269 0.1542027 -0.0203261 -0.0095877 -0.0178982 0.0842683 unknown
polarizability: 266.7249069|-0.3934801|139.9750464|12.6930879|32.2911106|126.782033 unknown
InChI: InChI=1S/C12H7ClN2O4/c13-11-4-2-1-3-9(11)10-6-5-8(14(16)17)7-12(10)15(18)19/h1-7H
charge 0 multiplicity 1
26 atoms
Cl 1.70938 -0.22391 -2.491298
O  -0.594438 -2.983145 -1.066895
O  1.160719 -2.38325 0.260955
O  -4.718711 1.583665 0.347188
O  -4.763649 -0.61825 -0.254992
N  0.040955 -2.141459 -0.32654
N  -4.142266 0.463315 0.06918
C  0.177792 0.340487 0.226926
C  1.670471 0.399471 0.253472
C  -0.595943 -0.810282 -0.099656
C  -0.541833 1.529643 0.524648
C  -2.000312 -0.785261 -0.17178
C  -2.657046 0.420326 0.129168
C  -1.947034 1.584549 0.48894
C  2.482171 0.181579 -0.887495
C  2.325869 0.765754 1.459667
C  3.883246 0.291886 -0.84498
C  3.730201 0.874904 1.526426
C  4.511312 0.634694 0.373797
H  0.02851 2.432923 0.761675
H  -2.563742 -1.681445 -0.443288
H  -2.494684 2.50263 0.716411
H  1.719497 0.932085 2.356815
H  4.471223 0.115514 -1.749964
H  4.210822 1.140589 2.473204
H  5.602393 0.714589 0.414313
