program: Gaussian 09
title: 000266809
version: EM64L-G09RevD.01
frameworkgroup: C1[X(C12H6Cl2N2O4)]
method: RPBEPBE
basis: SDD
operation: Freq
keyword: #p
keyword: freq=noraman
keyword: PBEPBE/SDD
title: #p freq=noraman PBEPBE/SDD
converged: YES YES NO NO
title: Mulliken charges:
elementType: Cl Cl O O O O N N C C C C C C C C C C C C H H H H H H
charge: 0.043146 0.043185 -0.157556 -0.157532 -0.140411 -0.140307 -0.006892 -0.006920 0.204793 0.306402 0.422410 0.422290 -0.351324 -0.351558 -0.258874 -0.371984 -0.372110 -0.216312 -0.216300 -0.227770 0.297313 0.260638 0.260718 0.238247 0.238228 0.238482
chargesum: 0.00000
title: Mulliken charges with hydrogens summed into heavy atoms:
elementType: Cl Cl O O O O N N C C C C C C C C C C C C
charge: 0.043146 0.043185 -0.157556 -0.157532 -0.140411 -0.140307 -0.006892 -0.006920 0.204793 0.306402 0.422410 0.422290 -0.351324 -0.351558 0.038439 -0.111346 -0.111392 0.021935 0.021928 0.010712
polarizability: 2.29621725e+02 5.61485203e-03 1.91640710e+02 -3.68795020e-02 -1.50674870e+01 1.21522709e+02
1716.lowfreq: -5.3055 -2.8246 0.0010 0.0022 0.0022 3.6017 34.2835 36.2307 46.0799
frequency: 34.2562 36.2187 46.0760 51.1742 61.8799 64.0732 95.7094 140.0636 155.3658 170.2423 174.7470 207.4911 228.6811 248.3441 261.9197 284.3552 312.7051 400.9127 404.9763 439.7713 459.9319 492.4042 508.4545 566.2540 571.6182 615.3541 624.8774 647.2416 679.8178 701.2551 713.7073 729.2172 748.2283 748.5573 784.0542 807.3002 855.1606 855.4407 886.3009 932.6324 982.3351 988.9909 1004.4834 1018.9867 1049.6633 1087.6445 1137.7665 1163.4110 1178.8534 1198.9486 1236.9733 1239.2960 1253.8655 1321.6216 1354.5566 1373.0091 1383.5120 1389.5623 1397.6493 1398.8733 1436.8753 1486.7084 1550.2734 1576.5635 1585.6663 1610.8301 3135.1690 3141.2040 3150.4088 3161.0261 3173.8233 3188.3758
redmass: 13.8485 13.3246 9.5944 6.6240 7.6918 7.1626 9.5712 12.7994 17.7249 20.5904 6.9810 14.5483 5.4633 9.8161 6.2479 15.6043 18.5181 2.8312 6.4749 12.8806 12.2293 5.4350 5.8065 4.4878 8.2889 6.5020 8.1505 11.3611 12.6626 2.3438 4.7305 5.8948 4.4316 13.3350 2.8782 7.4563 1.3821 1.2452 10.3580 1.3914 1.3971 6.0602 1.3290 3.9395 3.0393 1.6345 8.4035 1.5726 1.0538 1.1266 10.1347 7.1984 9.1007 1.4572 6.7890 5.2457 6.6123 4.5227 12.2649 11.1476 2.3058 2.4351 8.3228 11.4078 5.9703 5.9574 1.0854 1.0884 1.0929 1.0970 1.1018 1.0938
irintensity: 0.3658 0.0139 2.3224 0.3205 0.2847 1.4551 0.7968 4.0454 0.8060 0.3340 0.1312 0.3252 0.0859 0.0453 0.6365 0.0256 0.0004 0.4930 0.7528 11.1808 6.2248 3.4128 2.7233 6.6162 64.5280 0.6168 4.3254 0.5532 0.0610 23.0398 36.7501 4.5211 39.4379 10.0124 7.1848 22.6013 19.0702 0.6521 46.4491 2.1500 0.3215 4.6754 0.1109 2.3180 47.5954 8.7353 0.3657 18.6176 0.0211 2.4155 143.0887 34.0283 12.1614 4.7724 6.0464 4.2798 11.6743 37.6363 14.3612 248.2158 7.2409 7.3228 78.7377 60.3631 1.3126 0.7108 0.1693 1.3102 10.9783 14.8485 17.7437 5.4102
temp: 298.150 k
press: 1.00000 atm
elementType: 17 17 8 8 8 8 7 7 6 6 6 6 6 6 6 6 6 6 6 6 1 1 1 1 1 1
symmnumber: 1
zpe: 419313.2 jmol-1
zpe.correction: 0.159708 hartree
zpe.thermalcorrener: 0.177491 hartree
zpe.thermalcorrenthalpy: 0.178435 hartree
zpe.thermalcorrgfe: 0.111136 hartree
zpe.sumelectzpe: -1789.800921 hartree
zpe.sumelectthermal: -1789.783138 hartree
zpe.sumelectthermalent: -1789.782194 hartree
zpe.sumelectthermalfe: -1789.849492 hartree
dipole: 0.4427 -0.0004 -0.0028
dipole: 0.4427
quadrupole: -104.5445 -149.2381 -129.1317
quadrupole: 0.0237 0.0148 -4.2629
quadrupole: 23.0936 -21.6000 -1.4936 0.0237 0.0148 -4.2629
hfenergy: -1789.9606288 hartree
pointgroup: C01 [X(C12H6Cl2N2O4)]
dipole: 0.1741574 -0.001362 -0.0014835 debye
dipolederiv: -0.3050056 -0.2837181 0.0532575 -0.357909 -0.5009941 0.083099 0.0606191 0.0806531 -0.0077072 -0.2943133 0.2815377 -0.0431755 0.3557515 -0.514174 0.0736667 -0.0507363 0.0735055 -0.0046443 -0.2559148 -0.1375848 0.0168864 -0.1084637 -0.4955395 0.1770268 -0.0131373 0.0056224 -0.6248945 -0.251344 0.1327838 -0.0250363 0.1087547 -0.5000616 0.1736581 0.0010838 0.0003613 -0.6250515 -0.301788 -0.2075797 -0.1151476 -0.1634417 -0.4827829 -0.1418808 -0.0579969 -0.0106141 -0.5778989 -0.2880737 0.2030456 0.1025135 0.1551452 -0.4910249 -0.1495634 0.0481169 -0.0181625 -0.5827625 0.3794053 0.4388281 0.1110457 0.3606181 0.8557763 -0.0414612 0.0563835 0.0080359 1.114307 0.3571716 -0.4277921 -0.0872225 -0.3505698 0.8716249 -0.0271463 -0.0314006 0.0234627 1.1193162 0.5697005 -0.0061741 -0.0086526 -0.0045046 0.118674 0.0037511 -0.0104534 -0.0974965 0.0011557 -0.1068756 0.000549 0.0013317 -0.0003049 -0.0684688 -0.0242569 0.0020542 0.0135978 0.0027461 -0.2367101 0.0180784 -0.0075033 0.1862969 -0.0810444 0.0295591 -0.0611766 0.0301253 -0.0239893 -0.2390971 -0.0150507 0.014351 -0.1831114 -0.075402 0.0340969 0.0680941 0.0286397 -0.0261546 0.6060106 0.326833 -0.0610963 0.5565678 0.8242535 -0.1593939 -0.0879192 -0.1130455 -0.0424383 0.590697 -0.3243489 0.0392373 -0.5562363 0.8428642 -0.1444282 0.0677535 -0.1044825 -0.0461694 -0.228159 -0.0021137 0.0036918 -0.0018642 -0.5412996 0.0830191 0.0035627 0.0813553 -0.0374978 -0.0339341 -0.032772 0.0878214 0.1393727 -0.084629 -0.033532 -0.0823352 -0.0368015 -0.0019232 -0.0360339 0.0308959 -0.0874819 -0.140898 -0.082131 -0.0276493 0.0824727 -0.0395589 -0.001609 -0.0864974 0.0357898 -0.1231401 0.02399 -0.104131 -0.0681938 -0.1253173 -0.0645205 0.0669434 -0.0801502 -0.0381766 0.1262415 -0.0266152 -0.1029227 -0.0699318 0.1285852 -0.0660056 0.0593799 0.1469283 -0.0031389 -0.0031757 -0.0031381 -0.1237322 -0.0333403 -0.0031679 -0.0273383 -0.0411412 0.0618534 0.0004593 0.0015869 0.0004749 0.088875 0.0137034 0.0015665 0.0129278 0.1640333 0.0586565 0.0256688 -0.0791439 0.0123065 0.1179478 0.0520148 -0.0778903 0.0388085 0.0341653 0.062881 -0.0232855 0.0792425 -0.0094523 0.1187671 0.0507339 0.0776993 0.037975 0.0295523 0.0174416 -0.0205957 0.0657324 -0.0381682 0.1314929 0.0629861 0.0844656 0.0610411 -0.0272093 0.01415 0.0248368 -0.0657386 0.0423631 0.1301945 0.0630883 -0.0845057 0.0620837 -0.0226847 -0.1209991 0.0030248 0.0035749 0.0030361 0.1478675 0.0203745 0.0035795 0.0198309 0.1021763 unknown
polarizability: 229.5888327|-0.8761134|182.5069773|-1.6899737|-27.9941977|130.6893343 unknown
InChI: InChI=1S/C12H6Cl2N2O4/c13-8-6-9(14)12(16(19)20)10(11(8)15(17)18)7-4-2-1-3-5-7/h1-6H
charge 0 multiplicity 1
26 atoms
Cl 3.290135 2.682096 -0.534513
Cl 3.246468 -2.760165 0.426409
O  0.092859 -2.931425 1.57698
O  0.105711 2.917337 -1.596371
O  -0.276217 -3.035727 -0.678031
O  -0.188832 3.034415 0.668938
N  0.196307 -2.479505 0.377456
N  0.23753 2.465869 -0.399476
C  0.1935 -0.006493 -0.010362
C  -1.301149 0.009165 0.01192
C  0.934792 -1.197985 0.194144
C  0.953678 1.169002 -0.236276
C  2.362716 1.158855 -0.264293
C  2.343932 -1.217705 0.182248
C  3.072296 -0.036998 -0.051177
C  -2.000774 -0.404806 1.175872
C  -2.027235 0.437818 -1.130255
C  -3.411141 -0.386533 1.194353
C  -3.437604 0.44826 -1.105675
C  -4.132748 0.038005 0.055082
H  4.164236 -0.048467 -0.06662
H  -1.447014 -0.718776 2.067227
H  -1.494641 0.740812 -2.038132
H  -3.944075 -0.700546 2.097832
H  -3.991294 0.773259 -1.992645
H  -5.227839 0.04904 0.071659
