program: Gaussian 09
title: 000266806
version: EM64L-G09RevD.01
frameworkgroup: C1[X(C11H11NO3)]
method: RPBEPBE
basis: SDD
operation: Freq
keyword: #p
keyword: freq=noraman
keyword: PBEPBE/SDD
title: #p freq=noraman PBEPBE/SDD
converged: YES YES NO NO
title: Mulliken charges:
elementType: O O O N C C C C C C C C C C C H H H H H H H H H H H
charge: -0.212468 -0.243981 -0.243277 -0.407321 -0.305983 -0.462226 0.102461 0.198365 0.301141 0.247742 -0.358835 -0.402017 -0.268611 -0.197090 -0.503911 0.281372 0.236979 0.257681 0.300101 0.272680 0.220774 0.232222 0.226761 0.241139 0.243585 0.242718
chargesum: 0.00000
title: Mulliken charges with hydrogens summed into heavy atoms:
elementType: O O O N C C C C C C C C C C C
charge: -0.212468 -0.243981 -0.243277 -0.107220 -0.024611 0.032434 0.102461 0.198365 0.301141 0.247742 -0.086155 -0.181243 -0.036389 0.029671 0.223530
polarizability: 1.54337376e+02 1.30761729e+01 1.35166767e+02 2.28409331e+01 -1.09333444e+01 1.06813007e+02
1716.lowfreq: -11.9788 -5.8453 -1.1323 0.0001 0.0003 0.0005 24.7442 43.6214 85.4869
frequency: 24.7138 43.6077 85.4797 93.1771 127.3079 145.9772 182.0467 226.1114 269.0208 278.5494 305.4822 357.6912 414.6008 422.5532 453.0882 470.3709 507.7572 528.5002 540.3477 605.9867 621.7620 693.4746 700.9583 755.2426 767.6170 792.0828 815.9397 858.7263 863.1426 919.2481 946.3392 965.0809 988.9495 1009.4709 1027.9390 1056.7603 1113.0792 1115.9540 1132.9159 1150.8834 1168.4164 1177.5889 1210.2309 1238.4371 1247.0228 1274.6088 1285.5623 1302.6672 1351.9138 1398.9170 1420.5477 1425.7953 1454.0559 1458.3461 1461.4902 1478.7757 1511.6098 1576.4488 1587.5612 1628.4098 1630.0267 2943.9005 3008.2218 3032.7131 3072.5301 3111.7906 3117.7068 3138.6486 3148.2986 3156.7896 3169.2817 3575.4952
redmass: 5.4761 5.3102 2.0706 1.4836 6.9588 4.3288 4.5438 4.2473 4.0450 4.8419 2.8286 7.1114 1.4702 4.0207 3.6465 4.2614 5.0959 3.7158 5.4606 5.5780 4.9420 3.8260 4.8855 2.7690 1.7539 4.4500 4.3272 1.5825 4.7644 4.0713 2.8364 1.3662 1.3422 3.3851 2.1856 2.8975 1.3147 1.9974 1.6504 1.4386 1.2444 2.3844 2.0866 1.7808 1.5363 1.8160 1.5671 1.7895 1.4650 4.8634 1.2222 1.8432 1.0508 1.2624 1.0526 2.1491 2.4338 6.2068 8.7381 7.2920 8.8271 1.0697 1.0295 1.0831 1.0930 1.1048 1.0870 1.0895 1.0931 1.1049 1.1000 1.0776
irintensity: 3.4204 0.7115 0.4835 0.5109 2.8890 2.4011 5.3489 1.7012 12.3731 4.5623 17.7420 4.1737 77.5442 5.5001 22.8567 6.9206 19.6411 4.6111 5.2075 2.8492 12.8471 4.5241 0.8078 28.4465 67.7915 7.9591 14.0481 1.0952 9.1822 8.4390 15.0978 1.8664 0.5367 47.1764 4.0397 5.5756 2.2101 22.8199 17.1307 5.6263 53.8426 168.2391 54.9129 24.4353 11.9798 30.8167 18.2227 23.6491 90.4362 21.2808 21.2549 31.3069 12.6055 16.2575 11.8859 4.0454 134.2461 6.8157 279.7960 328.8365 32.9614 72.5536 28.4825 3.5066 8.2655 22.5047 8.4456 13.8771 9.4807 10.4334 24.7882 38.9326
temp: 298.150 k
press: 1.00000 atm
elementType: 8 8 8 7 6 6 6 6 6 6 6 6 6 6 6 1 1 1 1 1 1 1 1 1 1 1
symmnumber: 1
zpe: 527204.7 jmol-1
zpe.correction: 0.200802 hartree
zpe.thermalcorrener: 0.214254 hartree
zpe.thermalcorrenthalpy: 0.215199 hartree
zpe.thermalcorrgfe: 0.159548 hartree
zpe.sumelectzpe: -705.113275 hartree
zpe.sumelectthermal: -705.099822 hartree
zpe.sumelectthermalent: -705.098878 hartree
zpe.sumelectthermalfe: -705.154528 hartree
dipole: -0.9227 2.6872 -2.5288
dipole: 3.8036
quadrupole: -83.5951 -80.7302 -86.5773
quadrupole: -5.2152 1.8980 8.0916
quadrupole: 0.0391 2.9040 -2.9431 -5.2152 1.8980 8.0916
hfenergy: -705.3140768 hartree
pointgroup: C01 [X(C11H11N1O3)]
dipole: 0.4278374 -1.3579333 -0.4608058 debye
dipolederiv: -0.6255088 0.1563599 0.1462511 0.2829122 -1.0069211 -0.2965538 0.1475496 -0.1513517 -0.388329 -0.5416075 -0.0041193 -0.2174794 0.0672808 -0.5279276 0.4017899 -0.4662722 0.3264781 -1.0274664 -0.7045816 -0.3197798 0.0836739 -0.2597452 -0.6895422 0.2662312 -0.2468677 0.0020018 -0.5139585 -0.7928455 -0.5332675 0.2861314 -0.3600463 -0.6138072 0.2874683 0.1321784 0.2254229 -0.6030925 -0.2725447 -0.1946425 -0.056977 -0.2290864 -0.1750089 0.002017 -0.1570654 0.039088 -0.1456557 0.3801845 0.1082074 -0.1629233 -0.1756516 0.0417464 0.1100063 -0.1110435 0.0335063 0.5168205 1.3005764 -0.2844854 -0.4323764 -0.1221052 1.0719342 0.3596051 -0.5413869 0.2532952 0.3296572 -0.7282516 0.3660467 0.2986238 -0.1816394 -0.3342996 0.117206 0.4163174 -0.2564532 -0.2450977 0.5645895 0.5773864 -0.3316775 0.3638995 0.5972457 -0.3477237 -0.3495936 -0.4181978 0.37718 0.8458959 0.4031807 0.0955345 0.2702923 0.8887854 -0.5959768 0.6739206 -0.2568282 1.1063127 0.2963683 -0.2312984 -0.2094958 0.2116076 0.0376009 -0.1133764 -0.248831 0.1243583 0.0564124 -0.3292114 -0.3630866 0.1017849 -0.0397306 0.0282905 0.0069406 0.0929801 0.283712 -0.3163597 -0.2923724 0.2499008 -0.0032483 0.2163769 -0.2954826 -0.1129458 0.0267502 -0.162829 -0.2051988 0.0561575 0.0668671 -0.1335154 -0.1134884 0.4177713 0.0159222 -0.1131894 -0.0905199 -0.007829 0.4007298 -0.0603286 0.1660083 -0.0268543 0.2230452 0.0122035 0.2126018 -0.0429317 0.4943647 0.0123216 0.0115939 0.0395247 0.0291777 0.0878825 -0.0367823 0.0555801 -0.0219027 0.0143716 -0.0299103 -0.0278472 -0.1130066 0.0841721 0.0983053 -0.1161049 -0.0017418 0.0193994 -0.1850379 0.0539245 -0.0791288 0.0865804 -0.0847774 -0.0223737 0.0537097 0.0534897 -0.0038528 0.0885777 0.1796463 0.0543686 0.1044435 0.0484526 0.1831728 -0.0145583 0.1315202 0.0105202 0.219939 0.1287663 0.0525435 0.015013 -0.001612 -0.0103021 0.0128884 0.013803 -0.0213028 0.1336651 0.1027214 0.0084823 0.0452274 0.0533591 -0.1292825 -0.0077135 0.0489383 0.0307339 0.1288978 0.0219156 -0.0711577 0.1022852 -0.0822255 -0.0016157 0.0664975 0.1092326 0.0654799 0.0963949 -0.0301999 0.0540524 0.119158 0.0632671 0.0747989 -0.0386752 0.1246027 -0.0436921 0.0662621 0.0937704 -0.0415659 0.0137952 -0.0084347 0.0029985 0.1134982 -0.0285967 0.0808593 -0.0050484 -0.1237539 0.0299089 -0.0182034 -0.0237504 0.1047357 -0.0254563 0.0611924 -0.001492 0.0061193 0.0332197 0.0718091 -0.0251321 0.0183495 -0.0517501 -0.120117 -0.0360689 -0.0235012 0.0080986 unknown
polarizability: 147.9294457|1.9089915|138.5405312|-30.5596219|-7.2626956|109.8471735 unknown
InChI: InChI=1S/C11H11NO3/c1-15-11(14)8-6-12-9-5-3-2-4-7(9)10(8)13/h2-5,8,12H,6H2,1H3
charge 0 multiplicity 1
26 atoms
O  -0.601003 2.169481 1.233416
O  -2.359723 0.346926 -0.716178
O  -3.104319 -1.553658 0.396614
N  0.314443 -1.86209 0.912109
C  -1.37023 -0.144426 1.445847
C  -0.627404 -1.403538 1.942721
C  -0.364538 0.945872 1.010349
C  0.846738 0.454079 0.317378
C  1.12135 -0.955024 0.2352
C  -2.363472 -0.545331 0.341809
C  1.710696 1.374255 -0.336985
C  2.234388 -1.398437 -0.538953
C  2.812958 0.931186 -1.083434
C  3.061557 -0.466477 -1.186655
C  -3.311902 0.057544 -1.818049
H  -1.974686 0.272727 2.273142
H  -0.092041 -1.153385 2.884833
H  -1.356732 -2.204587 2.150277
H  0.547522 -2.853298 0.870442
H  1.46899 2.439061 -0.248693
H  2.449091 -2.471652 -0.613356
H  3.469447 1.646561 -1.588199
H  3.916054 -0.825497 -1.771984
H  -3.149907 0.866416 -2.543082
H  -4.346018 0.063682 -1.43541
H  -3.090755 -0.928191 -2.260059
