program: Gaussian 09
title: 000266801
version: EM64L-G09RevD.01
frameworkgroup: C1[X(C10H12O2)]
method: RPBEPBE
basis: SDD
operation: Freq
keyword: #pfreq=noraman
keyword: PBEPBE/SDD
title: #p freq=noraman PBEPBE/SDD
converged: YES YES NO NO
title: Mulliken charges:
elementType: O O C C C C C C C C C C H H H H H H H H H H H H
charge: -0.435223 -0.431749 -0.194399 -0.467663 -0.544696 0.231984 0.188295 -0.728751 0.082952 0.097671 -0.374631 -0.376958 0.239664 0.209814 0.224115 0.233154 0.242993 0.219021 0.212404 0.242890 0.213082 0.213499 0.351371 0.351160
chargesum: 0.00000
title: Mulliken charges with hydrogens summed into heavy atoms:
elementType: O O C C C C C C C C C C
charge: -0.083852 -0.080589 0.045266 -0.033734 -0.068549 0.231984 0.188295 -0.054436 0.082952 0.097671 -0.161549 -0.163460
polarizability: 1.36356627e+02 -6.78148315e-01 1.30266614e+02 -3.76886714e+00 -2.98429397e-01 6.60588839e+01
1716.lowfreq: -5.1550 -0.0005 -0.0003 0.0005 14.6796 16.1845 84.0170 123.0780 142.9197
frequency: 83.9833 123.0708 142.9154 187.6248 213.3527 240.7003 283.4996 317.6505 323.8838 333.9819 360.2795 383.2995 450.1872 507.3235 535.4493 553.9332 577.3203 611.4482 687.0778 715.0940 750.4646 770.2688 782.5396 872.3183 890.9586 908.3397 952.9794 965.1491 985.7801 1041.5673 1074.9645 1093.6741 1140.6516 1152.0346 1161.6423 1190.8281 1194.2614 1224.2688 1241.0414 1261.9388 1275.1735 1291.7601 1310.4636 1322.2261 1381.6638 1407.4142 1456.9668 1468.4067 1474.1987 1476.6881 1480.2719 1484.6519 1618.7538 1631.9940 2975.9652 2983.5110 2997.8517 3015.7261 3051.4904 3069.1651 3072.1297 3085.2027 3108.1227 3131.7498 3581.7755 3582.8949
redmass: 3.0659 2.7582 5.6521 2.4142 2.4999 1.2266 4.0086 1.5521 1.2907 1.5856 3.0801 3.4661 9.3566 3.6765 3.8461 3.5782 4.3903 3.5452 2.5834 6.8199 3.6436 1.5486 2.1111 1.3414 2.1643 3.3959 1.5150 3.0201 2.7623 1.6024 1.7945 1.6045 1.7150 1.2419 1.4004 1.5586 1.4552 1.5976 1.8175 2.7286 1.5951 2.0793 1.2958 1.6698 1.2028 6.4796 1.4615 1.1444 1.6896 1.4493 1.6807 1.1681 7.5797 7.7618 1.0354 1.0656 1.0674 1.0807 1.0947 1.1031 1.1003 1.0998 1.0864 1.0965 1.0659 1.0660
irintensity: 0.2264 4.2255 0.2892 8.3434 9.9398 5.1437 12.7841 102.3441 18.7628 125.9975 1.1700 0.1246 0.6164 3.5113 4.4423 8.7204 0.9547 11.1892 2.2463 26.5073 2.9006 59.5062 6.9732 0.0047 1.9908 74.2441 6.2989 9.1326 20.3486 13.1430 4.7310 17.5897 198.3410 6.0440 9.9607 1.7534 12.1458 24.7043 169.8916 15.0995 16.1497 1.3172 0.1767 2.0540 14.7205 2.6664 2.1186 48.3834 5.9176 38.2675 71.3816 13.5679 4.7227 0.5716 33.1819 26.6638 25.3888 33.4165 18.4330 45.4834 53.6650 27.0341 18.4694 20.6157 43.0943 8.5827
temp: 298.150 k
press: 1.00000 atm
elementType: 8 8 6 6 6 6 6 6 6 6 6 6 1 1 1 1 1 1 1 1 1 1 1 1
symmnumber: 1
zpe: 514537.6 jmol-1
zpe.correction: 0.195977 hartree
zpe.thermalcorrener: 0.207129 hartree
zpe.thermalcorrenthalpy: 0.208073 hartree
zpe.thermalcorrgfe: 0.159947 hartree
zpe.sumelectzpe: -537.818217 hartree
zpe.sumelectthermal: -537.807066 hartree
zpe.sumelectthermalent: -537.806121 hartree
zpe.sumelectthermalfe: -537.854247 hartree
dipole: -1.6570 1.7434 0.1294
dipole: 2.4087
quadrupole: -62.1405 -62.8864 -74.0078
quadrupole: -5.5130 -1.1736 0.1907
quadrupole: 4.2044 3.4585 -7.6629 -5.5130 -1.1736 0.1907
hfenergy: -538.0141943 hartree
pointgroup: C01 [X(C10H12O2)]
dipole: 0.7059533 0.629738 -0.0556691 debye
dipolederiv: -0.5389064 0.6654292 0.0380387 0.5755418 -0.9021188 -0.0766775 0.0151006 -0.0831629 -0.4031564 -0.6968205 0.6185266 0.034358 0.7261188 -0.7738978 -0.07484 0.0495764 -0.0741695 -0.4109371 0.0767211 -0.0145014 -0.0088407 0.0331389 0.1209567 0.0124738 -0.0824895 -0.0152815 0.1686806 0.0635383 0.0564803 0.0238764 0.0736225 0.0218338 0.0346429 -0.0316038 0.0041069 0.1151362 0.0582071 -0.014854 0.0394531 -0.0350851 -0.0259521 -0.0013353 0.0051717 -0.0384942 0.1553311 0.1889488 0.0044888 -0.0105968 0.1894543 -0.1850458 0.0046252 -0.0081193 0.0133993 -0.102375 -0.1283675 0.2776809 -0.000952 0.0620031 0.1687514 -0.0083197 0.0428496 0.0233398 -0.0703242 0.0026859 -0.0055939 -0.0686814 -0.0384854 0.0100019 0.0373041 0.0192691 0.0511805 -0.0195024 0.3323732 -0.6419603 -0.0538264 -0.5706512 0.8060493 0.0756698 -0.0301401 0.0795758 0.0333231 0.6072488 -0.6519014 -0.0674253 -0.7352092 0.5714543 0.0841161 -0.07831 0.0791272 0.0400898 -0.0488301 0.2779201 -0.0071786 -0.1034139 -0.1009481 0.0116598 -0.0207757 -0.0234698 -0.1897601 -0.0808272 -0.0951757 -0.019774 0.2908303 -0.0815417 -0.0267191 -0.0049094 0.0063775 -0.1919363 -0.0327737 0.0329102 0.0610156 0.0514448 0.0047372 -0.0661791 0.0797519 -0.0524013 -0.066744 -0.1087932 -0.1299334 -0.0357172 -0.1251547 -0.0280781 -0.0333739 -0.0759587 -0.0697028 0.0553671 0.0572086 0.0236987 -0.0132841 0.0275249 0.0518315 0.0205189 0.0413473 0.0694842 -0.1823325 0.0331458 -0.0624358 -0.0004751 -0.0358535 0.0023147 -0.0641423 0.0042272 -0.112253 -0.1009622 0.0126208 0.0677401 -0.0493329 0.0398917 -0.0434941 0.0723194 -0.0314442 0.1185325 0.0273569 0.0393436 0.0713669 0.0987649 0.0418127 0.0254382 -0.1101802 0.0449643 -0.0646389 -0.0560347 -0.2150226 -0.0824359 -0.0176857 -0.1142599 0.0651918 0.0001085 -0.0128754 0.0074888 0.0615302 0.1151804 0.0008359 -0.0065526 0.0473783 -0.1102843 0.0838439 0.0005376 0.0532619 0.0603198 0.0591192 -0.0403786 0.0095931 -0.0560334 -0.1393769 -0.0018216 0.0099422 -0.0021424 0.1698396 -0.1479476 -0.0172475 0.0313897 -0.0053794 0.0708138 -0.0002255 0.0327787 -0.000141 0.1677863 0.1802434 -0.2124545 0.0056389 -0.1287381 0.226681 0.0092297 0.0155347 0.0169215 0.3677506 0.1717038 -0.1282053 0.0181945 -0.2104984 0.2446821 0.017302 0.0155747 0.0130612 0.3715536 unknown
polarizability: 136.4459108|0.1337359|130.2024463|-3.545078|-0.0709617|66.033767 unknown
InChI: InChI=1S/C10H12O2/c1-6-2-3-7-8(11)4-5-9(12)10(6)7/h4-6,11-12H,2-3H2,1H3
charge 0 multiplicity 1
24 atoms
O  -0.99975 2.640389 0.224839
O  2.623034 -1.688915 -0.221546
C  -1.945948 -0.219337 0.269834
C  -1.747796 -1.729792 0.63827
C  -0.338483 -2.129123 0.09502
C  -0.5090 0.276846 0.159666
C  0.395619 -0.800907 0.045615
C  -2.719612 -0.009782 -1.059757
C  -0.038882 1.606979 0.117396
C  1.777698 -0.561032 -0.107056
C  1.347117 1.852723 -0.023792
C  2.253845 0.771038 -0.135105
H  -2.489617 0.320969 1.067359
H  -2.554517 -2.363932 0.228998
H  -1.756982 -1.842802 1.738607
H  -0.399095 -2.572125 -0.919096
H  0.174955 -2.87143 0.730847
H  -2.229431 -0.548981 -1.891742
H  -3.756632 -0.382827 -0.969188
H  -2.758742 1.062677 -1.3199
H  1.730265 2.881227 -0.046177
H  3.326844 0.976404 -0.242434
H  -0.55895 3.525714 0.210353
H  3.56686 -1.40698 -0.31191
