program: Gaussian 09
title: 000266796
version: EM64L-G09RevD.01
frameworkgroup: C1[X(C9H9NO4)]
method: RPBEPBE
basis: SDD
operation: Freq
keyword: #pfreq=noraman
keyword: PBEPBE/SDD
title: #p freq=noraman PBEPBE/SDD
converged: NO YES NO NO
title: Mulliken charges:
elementType: O O O O N C C C C C C C C C H H H H H H H H H
charge: -0.256946 -0.257092 -0.206456 -0.206465 0.026194 -0.151407 0.355768 -0.320048 -0.320274 -0.339073 -0.340780 -0.344704 -0.344511 0.378027 0.269688 0.241571 0.222503 0.222464 0.241553 0.277003 0.277305 0.287859 0.287821
chargesum: 0.00000
title: Mulliken charges with hydrogens summed into heavy atoms:
elementType: O O O O N C C C C C C C C C
charge: -0.256946 -0.257092 -0.206456 -0.206465 0.026194 0.118282 0.355768 0.144026 0.143743 -0.062070 -0.063475 -0.056845 -0.056690 0.378027
polarizability: 1.64584672e+02 1.54738938e-02 1.16043076e+02 6.67431502e+00 -5.70829053e-02 6.91182005e+01
1716.lowfreq: -51.2875 -12.1005 -2.0522 -0.0004 -0.0004 0.0002 10.6656 40.4188 55.4643
frequency: -51.2668 40.2124 55.4394 71.4811 119.5183 139.9239 247.2935 249.3831 285.2926 410.7355 428.0288 432.6430 489.5155 510.6296 621.6937 631.4176 672.1250 678.3665 715.6156 724.6639 785.3437 818.1949 837.0925 851.1376 864.6977 878.8198 902.7823 943.8248 955.4101 994.4559 1004.5318 1009.1166 1034.6083 1089.1816 1105.3510 1108.1677 1169.1225 1174.7063 1189.6227 1196.0373 1219.7748 1239.9635 1290.9119 1293.5813 1310.4807 1315.8642 1362.9816 1399.6023 1410.6370 1471.5366 1476.8727 1488.2187 1596.5889 1605.0919 3001.5493 3015.4053 3060.2544 3088.8543 3110.3946 3158.1085 3158.9212 3184.1004 3186.6389
redmass: 1.8279 5.6028 4.9736 5.9714 4.9565 9.7781 7.3467 6.8994 8.4020 2.9403 5.6771 6.9467 4.6286 6.5791 7.1014 6.6748 5.4602 6.3681 4.8129 6.1979 6.1355 1.6615 1.7318 3.1531 1.3768 4.3067 2.8044 3.5554 7.7221 1.4923 1.3650 2.6192 6.0870 3.3882 1.2907 1.5866 1.1992 1.2184 1.1149 3.0484 6.8940 1.1944 1.2590 1.2609 1.2317 1.2860 7.3581 8.4040 4.1669 2.4026 1.0876 1.0887 8.2144 6.3147 1.0634 1.0638 1.0870 1.1020 1.1054 1.0897 1.0900 1.0950 1.0962
irintensity: 0.7327 0.4360 3.3199 0.0336 6.8919 4.2989 0.7571 13.5825 0.8353 0.0020 17.7827 0.2113 7.6474 0.4959 0.0181 1.1071 19.2912 10.1758 13.0888 18.4861 32.2120 2.6672 33.6708 51.2070 5.2204 2.3138 91.5003 12.1676 24.7410 11.1270 0.0292 5.0050 102.1097 14.7509 8.8946 1.2018 6.4342 19.0063 0.0072 108.4744 232.3700 0.0687 0.2343 33.7645 2.3069 1.6569 82.2490 0.9399 69.4128 2.0935 6.2182 4.0512 0.5566 19.9073 21.4229 72.0802 9.3793 2.3448 56.3301 2.2220 0.1381 0.0530 1.6908
temp: 298.150 k
press: 1.00000 atm
elementType: 8 8 8 8 7 6 6 6 6 6 6 6 6 6 1 1 1 1 1 1 1 1 1
symmnumber: 1
zpe: 447896.9 jmol-1
zpe.correction: 0.170595 hartree
zpe.thermalcorrener: 0.181690 hartree
zpe.thermalcorrenthalpy: 0.182634 hartree
zpe.thermalcorrgfe: 0.131876 hartree
zpe.sumelectzpe: -702.863897 hartree
zpe.sumelectthermal: -702.852802 hartree
zpe.sumelectthermalent: -702.851857 hartree
zpe.sumelectthermalfe: -702.902616 hartree
dipole: -4.8706 -0.0120 1.2006
dipole: 5.0164
quadrupole: -101.9003 -80.6767 -76.8131
quadrupole: 0.1104 -10.4995 -0.0788
quadrupole: -15.4369 5.7867 9.6503 0.1104 -10.4995 -0.0788
hfenergy: -703.0344916 hartree
pointgroup: C01 [X(C9H9N1O4)]
dipole: 1.9432936 0.0813605 0.3347537 debye
dipolederiv: -0.7790725 0.0212611 -0.180118 -0.0462821 -0.461507 -0.0187373 -0.2247577 0.0983244 -0.6143276 -0.7921251 -0.1433631 -0.0937763 -0.1501488 -0.5796596 0.0058944 -0.1851656 -0.1044089 -0.4820279 -0.7320467 -0.1187642 0.1864794 -0.1125914 -0.5259289 0.1794808 0.2093062 0.188352 -0.3765442 -0.6941499 0.2229804 0.0014088 0.2381727 -0.6345188 0.1509941 0.0180687 0.1404141 -0.3058475 1.7263766 -0.1909175 -0.2968877 -0.2176363 0.9314659 -0.3230348 -0.346477 -0.3209611 0.4468692 1.2282394 0.0370578 0.119508 0.0575326 0.6271777 -0.0814592 0.1533852 -0.0827741 0.5380251 0.000704 -0.0243177 -0.0446597 -0.0531925 -0.0138727 -0.0265373 -0.0963691 -0.0240602 -0.0587824 0.4320988 0.0217677 0.0454292 0.1286886 0.1202082 0.1692743 0.1196725 0.023895 0.416964 0.4255276 0.0009648 0.0578488 0.0097923 0.2378365 0.0991664 0.1985545 0.233221 0.3064975 -0.2885823 -0.1480818 0.0801267 -0.1021667 0.039768 -0.0401916 0.1018157 -0.0489316 -0.1242188 -0.2575079 0.1711021 -0.0946773 0.1642391 -0.0588391 -0.0823405 -0.0444851 -0.0781572 -0.0579064 0.1339009 0.0753201 -0.1062843 -0.185563 -0.0454522 0.01499 0.0345802 -0.0498102 -0.075229 0.1391124 -0.1464137 0.0076263 0.1194208 -0.0484379 -0.0476241 -0.1230366 0.016867 -0.0764637 -0.6317739 0.0951506 0.1109719 0.1152655 0.0333646 -0.018116 0.1490136 -0.0201232 0.026912 -0.0800523 0.0184269 0.0200751 -0.0080027 0.0382894 -0.0622082 -0.0306492 -0.0591709 -0.040092 -0.1080067 0.0600491 -0.100109 0.0486693 0.0611647 0.0254065 -0.0705618 0.0108377 0.0385451 -0.0013095 -0.0016292 0.1415877 -0.0219855 0.0394685 -0.0441419 0.0623855 -0.0196961 -0.1101598 0.0103659 0.1197812 0.0710006 0.0631475 -0.0523056 -0.0728151 0.0094568 -0.0891987 -0.0296809 -0.1241513 -0.1040414 -0.0131558 -0.0719114 0.0447533 -0.0128084 -0.0054005 -0.0003887 0.0701614 0.1050021 0.0686253 0.001314 0.0596393 0.02995 0.0479338 -0.0076353 0.0503495 0.114467 0.0939543 -0.044023 0.0616372 -0.0468057 0.0492017 0.051677 0.0492778 0.0505619 0.106638 0.0927266 -0.0463724 0.0397328 -0.0177004 0.0971999 0.0432227 0.0279543 0.0520066 0.133956 0.1007694 0.0554367 -0.0150781 0.0294188 0.0706735 0.0419743 0.0010667 0.0328515 0.1522447 unknown
polarizability: 163.0434956|-8.1716528|106.7128235|-10.8454521|-18.4741298|79.9896296 unknown
InChI: InChI=1S/C9H9NO4/c11-10(12)8-3-1-7(2-4-8)9-13-5-6-14-9/h1-4,9H,5-6H2
charge 0 multiplicity 1
23 atoms
O  3.00101 -1.378147 0.098179
O  3.110354 0.669331 -1.014999
O  -3.918165 -0.515828 0.970772
O  -3.808303 1.498972 -0.093128
N  -3.278111 0.393544 0.313572
C  2.328239 -0.565031 -0.91767
C  0.860592 -0.296819 -0.565666
C  3.48269 -0.409889 1.118795
C  3.557955 0.960937 0.372955
C  0.11602 -1.265751 0.153045
C  0.233108 0.898905 -0.996723
C  -1.244296 -1.046898 0.446426
C  -1.126233 1.134447 -0.711174
C  -1.843715 0.15374 0.007606
H  2.435108 -1.09352 -1.879729
H  4.46098 -0.780662 1.460679
H  2.775086 -0.371116 1.967562
H  2.89098 1.711611 0.835976
H  4.578931 1.363919 0.291524
H  0.617233 -2.180307 0.485021
H  0.823096 1.639546 -1.545576
H  -1.841759 -1.775051 1.000881
H  -1.634699 2.048665 -1.027831
