program: Gaussian 09
title: 000266788
version: EM64L-G09RevD.01
frameworkgroup: C1[X(C17H18Cl2O4)]
method: RPBEPBE
basis: SDD
operation: Freq
keyword: #p
keyword: freq=noraman
keyword: PBEPBE/SDD
title: #p freq=noraman PBEPBE/SDD
converged: YES YES NO NO
title: Mulliken charges:
elementType: Cl Cl O O O O C C C C C C C C C C C C C C C C C H H H H H H H H H H H H H H H H H H
charge: -0.056601 -0.066928 -0.459506 -0.440790 -0.536731 -0.453990 -0.306932 -0.258410 -0.124115 -0.075580 0.477510 0.431140 -0.388887 -0.432820 -0.365960 -0.389946 -0.389398 -0.216272 -0.227931 -0.211881 -0.234902 -0.123866 -0.113186 0.255875 0.205900 0.239420 0.245634 0.221098 0.243243 0.392900 0.270187 0.241885 0.257920 0.274881 0.354699 0.386536 0.257591 0.253414 0.255669 0.251412 0.357720
chargesum: 0.00000
title: Mulliken charges with hydrogens summed into heavy atoms:
elementType: Cl Cl O O O O C C C C C C C C C C C C C C C C C
charge: -0.056601 -0.066928 -0.066606 -0.086091 -0.150195 -0.096269 -0.051057 -0.052510 0.115305 0.170054 0.477510 0.431140 0.075454 -0.162633 -0.124075 -0.132026 -0.114517 0.041319 0.025483 0.043788 0.016510 -0.123866 -0.113186
polarizability: 2.57509832e+02 2.47712537e+01 2.22714155e+02 1.57230205e+01 5.60887857e+00 1.63136387e+02
1716.lowfreq: -11.0902 -4.6909 0.0007 0.0010 0.0015 3.3081 9.9126 25.1437 30.9784
frequency: 6.3891 25.0496 30.9330 34.8536 45.3713 58.1442 75.5307 100.2163 106.0500 127.7170 142.3508 174.8340 201.4595 205.5159 233.5775 266.5967 273.0453 290.0230 307.1668 317.6538 321.7944 330.4381 359.4403 369.8063 404.8386 406.4370 409.1599 441.8287 461.0036 498.8653 521.3612 540.1901 548.5050 589.4507 601.8872 624.9454 630.0342 665.9097 676.0767 714.4558 724.4550 733.3279 791.6157 809.9920 821.5582 826.5840 829.5277 834.5705 849.6909 854.6991 879.7590 932.1626 945.1920 953.0865 960.9584 965.0221 971.0438 999.6528 1000.9842 1002.4921 1028.8495 1041.2927 1049.9033 1072.1713 1075.8862 1083.8359 1106.7445 1116.9629 1140.4359 1184.9078 1189.3317 1192.0749 1198.7562 1201.6912 1211.6571 1239.9108 1261.9888 1281.9323 1292.0648 1300.8028 1304.9089 1321.5367 1326.5221 1341.1792 1353.8916 1369.9498 1373.0285 1376.7143 1386.5776 1393.9408 1398.0212 1418.4812 1454.7556 1475.7124 1479.2393 1582.3385 1586.4573 1596.3684 1601.1372 2952.4309 2981.1337 3001.4739 3006.4888 3043.5764 3091.7949 3128.2928 3132.0932 3135.3014 3158.5899 3167.0164 3167.9945 3170.2721 3180.5401 3250.0704 3432.0220 3466.1560 3572.4198
redmass: 4.5032 5.4852 9.9672 7.7586 4.2844 5.4991 5.9939 7.0434 3.2487 8.1744 7.5153 7.5109 8.4586 7.6464 5.4366 7.5697 6.1696 5.1594 5.3914 1.1011 6.2906 4.8449 5.0481 7.2886 3.1028 4.7058 3.1903 6.5010 3.9855 3.3990 3.0127 2.6889 1.1418 1.7999 1.7343 6.8726 6.4077 6.2396 4.8264 3.7832 3.8709 2.9307 2.2330 2.6451 1.3127 1.2940 1.7042 1.2548 2.8387 2.6554 3.5205 5.0601 1.4896 1.5029 1.9615 1.3948 1.3763 4.1392 4.2557 3.5253 2.4402 2.4251 3.3955 2.7343 2.6562 3.0163 1.3980 1.4164 1.2615 1.1422 2.1848 1.1440 1.5596 1.7262 1.3314 1.3127 1.4516 1.2180 1.2355 1.2760 1.3857 1.3116 1.2561 1.3260 1.3413 5.0660 1.3340 6.1935 1.2665 2.7991 2.4893 1.4756 1.0830 2.3977 2.3780 7.4419 7.4581 6.1613 6.1097 1.0825 1.0853 1.0824 1.0620 1.0848 1.1038 1.0896 1.0898 1.0902 1.0891 1.0951 1.0953 1.0961 1.0959 1.0646 1.0643 1.0650 1.0666
irintensity: 0.3858 0.5646 0.1779 0.8254 0.2102 0.2823 4.7904 2.0080 13.1098 0.0426 5.1365 5.0846 4.6261 1.0096 8.4685 3.2408 6.0880 6.8144 4.1844 85.8773 13.7821 4.1655 3.1545 10.3591 0.4681 10.9334 2.5159 8.2095 33.3239 14.8375 11.0983 45.4771 110.2803 126.8936 70.4386 1.4372 1.2039 16.8283 15.4893 6.4607 1.2336 33.7338 71.7835 12.9981 87.2248 49.3051 98.9512 9.6999 5.5721 21.8421 45.2233 107.1812 4.0421 3.7049 13.0395 0.7947 0.2767 58.0330 32.7154 22.4179 12.0839 28.7668 23.8614 46.3047 27.8535 39.4976 8.0254 12.0039 63.7795 0.7510 6.4433 2.1555 35.4267 10.1907 22.2040 25.8874 16.9070 15.4450 1.9415 3.3065 2.0026 37.9977 22.1473 9.1682 15.4180 1.6084 24.7904 0.7444 37.0845 10.9055 5.6697 60.0966 5.8177 101.7243 93.7955 1.3758 4.5959 7.4340 3.3095 28.0544 37.3216 8.8647 22.8194 22.1006 23.6629 8.6132 5.5704 3.8420 2.3222 4.4698 5.1224 0.8866 2.0856 340.6380 31.7328 60.9229 15.0610
temp: 298.150 k
press: 1.00000 atm
elementType: 17 17 8 8 8 8 6 6 6 6 6 6 6 6 6 6 6 6 6 6 6 6 6 1 1 1 1 1 1 1 1 1 1 1 1 1 1 1 1 1 1
symmnumber: 1
zpe: 827067.6 jmol-1
zpe.correction: 0.315013 hartree
zpe.thermalcorrener: 0.337474 hartree
zpe.thermalcorrenthalpy: 0.338418 hartree
zpe.thermalcorrgfe: 0.259261 hartree
zpe.sumelectzpe: -1877.900673 hartree
zpe.sumelectthermal: -1877.878212 hartree
zpe.sumelectthermalent: -1877.877268 hartree
zpe.sumelectthermalfe: -1877.956425 hartree
dipole: 4.9606 -1.8293 -1.2833
dipole: 5.4407
quadrupole: -150.7823 -152.6743 -150.9208
quadrupole: -15.0742 -4.4114 8.5949
quadrupole: 0.6768 -1.2152 0.5383 -15.0742 -4.4114 8.5949
hfenergy: -1878.2156861 hartree
pointgroup: C01 [X(C17H18Cl2O4)]
dipole: -2.0354374 0.3333161 -0.5725027 debye
polarizability: 248.0957251|29.3409627|232.501178|-12.6336588|-9.2121658|162.7634707 unknown
InChI: InChI=1S/C17H18Cl2O4/c18-12-5-1-10(2-6-12)15(11-3-7-13(19)8-4-11)17(23)16(22)14(21)9-20/h1-8,14-17,20-23H,9H2
charge 0 multiplicity 1
41 atoms
Cl -1.601628 -5.403855 -0.593566
Cl 6.259598 1.068833 -0.597591
O  -0.338934 2.666456 0.761166
O  -2.312809 1.309719 2.084639
O  -2.599832 3.318239 -0.35808
O  -4.2608 2.441332 -2.307909
C  0.283888 0.308443 0.840554
C  -0.703001 1.339113 0.22959
C  -2.182946 1.086973 0.640511
C  -3.178146 1.96953 -0.151643
C  -0.156279 -1.120421 0.491709
C  1.753978 0.550041 0.45613
C  -3.537476 1.40171 -1.539853
C  -0.878859 -1.900174 1.429445
C  2.737143 -0.325712 0.989477
C  0.115327 -1.675878 -0.7853
C  2.184187 1.5951 -0.397806
C  -1.319691 -3.205228 1.111414
C  4.105732 -0.177646 0.682237
C  -0.322713 -2.974739 -1.125678
C  3.550642 1.756104 -0.726331
C  -1.036223 -3.720821 -0.167245
C  4.491526 0.865429 -0.181553
H  0.19943 0.428973 1.939025
H  -0.617112 1.326184 -0.879212
H  -2.464424 0.031547 0.481082
H  -4.09337 2.069197 0.468843
H  -4.130615 0.471355 -1.450938
H  -2.630909 1.201373 -2.134443
H  -1.004886 3.298722 0.341009
H  -1.10975 -1.480821 2.415668
H  2.429348 -1.144311 1.650963
H  0.696883 -1.100706 -1.514978
H  1.462817 2.321265 -0.779302
H  -1.726129 2.094291 2.282279
H  -3.083705 3.720632 -1.130436
H  -1.870824 -3.80427 1.842032
H  4.85271 -0.857265 1.102318
H  -0.106687 -3.400173 -2.110081
H  3.8736 2.568945 -1.383336
H  -5.218062 2.440311 -2.053915
