program: Gaussian 09
title: 000266776
version: EM64L-G09RevD.01
frameworkgroup: C1[X(C16H10Br2N2)]
method: RPBEPBE
basis: SDD
operation: Freq
keyword: #p
keyword: freq=noraman
keyword: PBEPBE/SDD
title: #p freq=noraman PBEPBE/SDD
converged: NO YES NO NO
title: Mulliken charges:
elementType: Br Br N N C C C C C C C C C C C C C C C C H H H H H H H H H H
charge: 0.062687 0.062725 0.055737 0.055831 0.000997 0.000865 0.308473 0.308325 -0.365755 -0.365647 -0.362222 -0.362376 -0.226519 -0.226486 -0.233898 -0.233858 -0.237555 -0.237528 -0.228357 -0.228400 0.260760 0.260760 0.266247 0.266206 0.232904 0.232916 0.232755 0.232754 0.233834 0.233827
chargesum: 0.00000
title: Mulliken charges with hydrogens summed into heavy atoms:
elementType: Br Br N N C C C C C C C C C C C C C C C C
charge: 0.062687 0.062725 0.055737 0.055831 0.000997 0.000865 0.308473 0.308325 -0.104995 -0.104888 -0.095975 -0.096170 0.006385 0.006430 -0.001144 -0.001103 -0.003721 -0.003701 -0.228357 -0.228400
polarizability: 3.50308309e+02 -2.20526999e-02 2.71118237e+02 -1.62588356e-02 1.97528105e+01 1.13274735e+02
1716.lowfreq: -4.5965 -0.0005 -0.0003 -0.0001 4.5371 5.8541 22.7350 48.3582 49.3325
frequency: 22.7326 48.3338 49.3247 61.0630 77.8076 85.3805 111.9686 159.7735 175.1832 209.5621 215.2149 230.9607 241.3292 300.2373 359.8411 380.4591 402.8900 406.7926 443.4209 468.4949 502.3490 541.0868 594.5265 606.0726 615.0888 619.6343 642.2166 643.1323 695.0185 699.8522 702.9191 747.8916 775.0677 790.8271 835.1812 854.5868 855.8776 933.0053 935.0299 955.0030 983.0904 984.1210 989.1703 989.2922 1000.8826 1001.1289 1014.8380 1028.2077 1053.3271 1083.6255 1084.8601 1164.5942 1171.2566 1175.2893 1175.9960 1193.2735 1194.7471 1283.3943 1318.3520 1320.9689 1339.0732 1352.5132 1378.7432 1380.6171 1412.3303 1436.5972 1443.6667 1484.6342 1489.0514 1491.6044 1583.0845 1583.5932 1608.3201 1611.6128 3130.1337 3130.2499 3140.1729 3140.4707 3152.7976 3153.1586 3162.0893 3162.2388 3171.6678 3171.8144
redmass: 14.9388 4.8783 3.8000 6.9370 4.1887 7.4781 41.2705 7.0897 6.7732 11.2684 11.7632 7.0826 5.3530 5.7596 9.5371 6.2768 2.9046 2.8384 5.7856 7.0097 4.8352 7.2383 5.2344 8.7408 6.4885 8.2327 7.2258 8.8676 3.3931 1.7622 2.4329 2.9974 1.9005 3.1489 8.6937 1.2477 1.2461 1.4012 1.4180 8.8243 1.4502 1.3937 5.1689 6.2252 1.3216 1.3253 4.2503 2.1811 2.5344 1.6708 1.6523 4.2014 3.8095 1.0787 1.1977 1.1174 1.1181 10.4803 1.5088 1.4082 6.3379 3.3886 5.8723 8.6974 4.6614 2.3316 2.6319 3.3668 5.0714 2.7853 5.9725 5.9775 5.9576 6.0183 1.0851 1.0852 1.0885 1.0884 1.0930 1.0928 1.0961 1.0959 1.1010 1.1010
irintensity: 0.0086 0.1107 0.0285 0.5380 0.1382 0.0632 0.1134 0.2524 0.2189 0.9121 8.1853 0.4441 0.0077 1.0839 2.3958 1.7759 0.1299 0.7359 12.8634 0.2099 26.6895 8.6857 22.5602 0.3093 0.4746 0.0929 0.4667 3.1394 7.9393 86.0144 18.0832 1.5537 74.6757 17.9479 64.5839 2.6031 1.3731 0.9431 6.4448 69.6893 0.3672 4.1167 2.8391 2.9092 0.3916 0.4659 0.0279 3.2123 47.5951 7.0091 8.2635 8.1231 299.4002 0.1392 44.8223 6.7994 3.7577 80.8550 22.0343 1.4894 193.1524 76.9990 3.6041 10.3890 81.8145 6.7822 8.5077 10.2031 29.7059 4.5858 1.9960 1.1717 5.5885 2.7370 0.6987 0.0772 8.1038 2.6431 29.2601 15.7144 25.6313 8.8566 16.8078 21.0944
temp: 298.150 k
press: 1.00000 atm
elementType: 35 35 7 7 6 6 6 6 6 6 6 6 6 6 6 6 6 6 6 6 1 1 1 1 1 1 1 1 1 1
symmnumber: 1
zpe: 558152.4 jmol-1
zpe.correction: 0.212589 hartree
zpe.thermalcorrener: 0.229459 hartree
zpe.thermalcorrenthalpy: 0.230403 hartree
zpe.thermalcorrgfe: 0.164740 hartree
zpe.sumelectzpe: -750.755424 hartree
zpe.sumelectthermal: -750.738553 hartree
zpe.sumelectthermalent: -750.737609 hartree
zpe.sumelectthermalfe: -750.803273 hartree
dipole: 4.6940 0.0005 -0.0004
dipole: 4.6940
quadrupole: -119.0516 -124.8669 -132.8793
quadrupole: -0.0058 0.0003 3.7459
quadrupole: 6.5477 0.7324 -7.2800 -0.0058 0.0003 3.7459
hfenergy: -750.9680125 hartree
pointgroup: C01 [X(C16H10Br2N2)]
dipole: -1.846742 -0.0048392 -0.0021909 debye
polarizability: 350.3070236|0.329742|241.4914369|0.4190823|-64.7209946|142.9028204 unknown
InChI: InChI=1S/C16H10Br2N2/c17-15-16(18)20-14(12-9-5-2-6-10-12)13(19-15)11-7-3-1-4-8-11/h1-10H
charge 0 multiplicity 1
30 atoms
Br 4.586181 -1.415875 1.077461
Br 4.580982 1.44147 -1.06664
N  1.800278 -1.237693 0.585692
N  1.795129 1.249804 -0.579856
C  0.596068 -0.681146 0.231453
C  0.593148 0.687157 -0.227847
C  -0.584278 -1.581293 0.304555
C  -0.592025 1.580552 -0.304693
C  -1.652281 -1.483027 -0.629246
C  -1.661025 1.477157 0.627522
C  -0.614921 -2.614186 1.280619
C  -0.62676 2.612381 -1.281657
C  -2.734627 -2.384471 -0.57074
C  -2.748408 2.372304 0.566324
C  -1.703699 -3.507919 1.342582
C  -1.720627 3.499703 -1.346413
C  -2.769882 -3.395186 0.419273
C  -2.787715 3.381763 -0.424782
C  2.953101 -0.607519 0.364725
C  2.950731 0.625667 -0.356147
H  -1.631464 -0.712903 -1.406553
H  -1.637077 0.708057 1.405741
H  0.225433 -2.706076 1.97598
H  0.214229 2.708333 -1.975701
H  -3.547063 -2.302877 -1.300912
H  -3.561548 2.286914 1.295278
H  -1.718523 -4.29387 2.105427
H  -1.738758 4.284755 -2.110105
H  -3.614099 -4.092056 0.464425
H  -3.635802 4.073783 -0.472064
