program: Gaussian 09
title: 000266770
version: EM64L-G09RevD.01
frameworkgroup: C1[X(C10H5N5O4)]
method: RPBEPBE
basis: SDD
operation: Freq
keyword: #p
keyword: freq=noraman
keyword: PBEPBE/SDD
title: #p freq=noraman PBEPBE/SDD
converged: YES YES NO NO
title: Mulliken charges:
elementType: O O O O N N N N N C C C C C C C C C C H H H H H
charge: -0.187683 -0.117481 -0.149532 -0.180323 -0.286284 -0.446985 0.008173 -0.091993 -0.004109 0.076333 0.204034 0.142522 0.100360 0.310239 -0.368603 0.332642 -0.341893 -0.186248 -0.301211 0.285225 0.285513 0.256985 0.387810 0.272509
chargesum: 0.00000
title: Mulliken charges with hydrogens summed into heavy atoms:
elementType: O O O O N N N N N C C C C C C C C C C
charge: -0.187683 -0.117481 -0.149532 -0.180323 -0.286284 -0.059174 0.008173 -0.091993 -0.004109 0.076333 0.204034 0.142522 0.100360 0.310239 -0.083379 0.332642 -0.056380 0.070737 -0.028702
polarizability: 2.54429286e+02 -7.46533927e+00 1.78974214e+02 7.83462714e+00 8.62562935e-01 6.64361596e+01
1716.lowfreq: -0.0008 -0.0007 -0.0005 0.9282 7.5478 9.7117 36.0119 52.8036 59.0030
frequency: 35.9745 52.8027 58.9995 72.2785 108.5023 162.6624 174.2977 179.9927 193.9769 274.5794 305.2884 327.0116 334.8554 356.6834 365.0010 412.4105 449.7014 515.5695 567.8361 577.4644 640.9760 646.5408 678.3532 681.6521 700.4312 709.6538 737.8590 758.1158 766.9941 803.7613 832.2347 849.2795 851.4608 894.7430 919.5519 950.5555 980.0784 1005.2126 1029.1242 1050.1128 1064.0044 1134.5502 1142.2336 1172.1634 1189.6979 1221.4863 1228.6957 1238.2574 1248.7769 1290.7225 1322.6946 1384.0218 1396.1858 1417.0320 1444.0905 1454.1920 1523.8104 1604.4567 1614.2575 1636.7780 1693.6916 3160.0021 3174.4472 3186.5941 3264.1094 3561.6026
redmass: 7.3802 11.8524 8.2119 13.6830 9.9987 9.5083 9.4528 5.7679 6.9253 10.3140 7.9430 8.7947 9.5636 9.3445 9.3194 7.1959 4.9842 7.9539 11.4652 6.3866 5.7567 5.2684 9.4529 6.3674 8.7153 6.9830 7.7606 11.6203 3.7043 1.1315 1.8044 7.6653 1.3190 8.4381 9.0918 1.3979 4.8497 1.3744 8.5449 2.6606 3.2306 4.4973 3.4040 1.4993 2.0324 6.6139 4.7949 2.2807 2.2816 3.6539 3.3837 11.1256 3.6786 4.5054 4.3793 2.7063 6.0871 8.0473 8.6419 10.5850 12.9308 1.0884 1.0935 1.0990 1.0994 1.0846
irintensity: 0.5178 0.8816 4.8752 0.4315 2.5365 3.0472 0.4347 0.2283 0.4880 0.5092 2.0822 2.3077 4.7674 0.4386 3.8292 3.2216 0.3896 5.2539 11.0781 1.8157 1.8588 4.4647 30.8274 19.2826 4.3576 10.4043 11.4203 19.6306 14.6102 105.4628 36.2196 31.6748 48.2302 1.4600 32.3374 0.8962 3.5520 1.7405 90.0355 31.1778 39.6427 4.7746 11.5725 16.5380 2.5425 232.9645 26.2701 20.4804 79.7369 80.3552 22.5986 137.5094 5.2307 52.0511 18.2404 5.9060 228.6234 3.4911 33.9786 289.5216 77.4396 2.8505 2.3009 1.6890 1.2028 92.7587
temp: 298.150 k
press: 1.00000 atm
elementType: 8 8 8 8 7 7 7 7 7 6 6 6 6 6 6 6 6 6 6 1 1 1 1 1
symmnumber: 1
zpe: 399439.9 jmol-1
zpe.correction: 0.152139 hartree
zpe.thermalcorrener: 0.166653 hartree
zpe.thermalcorrenthalpy: 0.167597 hartree
zpe.thermalcorrgfe: 0.109013 hartree
zpe.sumelectzpe: -957.313212 hartree
zpe.sumelectthermal: -957.298698 hartree
zpe.sumelectthermalent: -957.297754 hartree
zpe.sumelectthermalfe: -957.356337 hartree
dipole: -4.0603 3.8320 -0.1326
dipole: 5.5846
quadrupole: -109.2039 -117.4329 -107.7111
quadrupole: -20.5916 -1.7948 0.0776
quadrupole: 2.2454 -5.9836 3.7382 -20.5916 -1.7948 0.0776
hfenergy: -957.4653504 hartree
pointgroup: C01 [X(C10H5N5O4)]
dipole: 1.6199282 1.4777375 0.1400642 debye
dipolederiv: -0.5377468 -0.1898247 -0.0128112 0.1488558 -0.9128626 0.0759952 -0.0063679 0.0694732 -0.2837408 -0.5016581 0.2828715 -0.006482 0.0579667 -0.8783923 0.0173738 -0.0062728 0.0076159 -0.2670512 -0.3283264 0.0662646 -0.1762343 0.0660821 -0.5416916 -0.1959688 -0.1818502 -0.0949895 -0.4231144 -0.6223347 0.1506654 -0.2745014 0.3008017 -0.4965385 0.0382706 -0.2047053 -0.0399596 -0.4167872 -1.2724418 -0.0690459 -0.0487823 -0.0474285 -1.1351211 0.0572946 -0.0285277 0.0067007 -0.065918 -0.1071214 0.2911263 -0.0188108 0.2327422 -0.3295687 0.021789 -0.0055346 0.0291667 -0.1928091 0.7856816 -0.2821122 0.5225302 -0.5527072 1.1397983 0.1947263 0.4042803 0.1307005 0.6800438 -0.4885296 -0.0000116 -0.0136274 0.073758 -0.311256 0.0138859 -0.0260031 0.0118513 -0.20642 -0.5365424 -0.2526571 0.0032518 0.0471079 -0.2167487 0.0074374 -0.0256973 -0.0107826 -0.1706506 -0.3103484 -0.3380608 -0.0134785 -0.2123105 -0.1622559 0.0022471 0.0553671 -0.0978815 -0.0088797 -0.4865169 0.0561601 -0.0111285 -0.0093599 -0.1184989 -0.0119392 -0.0222457 -0.0101189 0.0097966 1.3440315 -0.0685637 0.0345181 -0.3815928 1.2395703 -0.135121 0.0229114 -0.045204 0.2544074 1.1304159 -0.0657719 0.0136436 0.3321097 1.5541326 -0.0164036 0.036811 0.0013615 0.2455317 0.1746035 0.1735684 -0.0623768 0.0871249 -0.0759813 -0.020142 -0.0304166 0.017905 0.0449272 0.0268309 -0.057114 0.0151651 0.0451296 0.156008 0.004904 0.0033095 -0.0034895 -0.0793466 0.9066212 0.1171587 0.0333857 0.0635292 0.3934766 -0.0275629 0.020332 -0.015663 0.1412753 -0.0686033 -0.0056306 0.0036052 -0.2471213 -0.127363 -0.0250474 -0.0373826 0.0647498 -0.0847109 -0.0422545 0.1149557 0.0067555 0.2764569 0.0697113 0.0235355 0.0090035 0.0258074 -0.1100292 0.4049817 -0.0003876 0.0201302 -0.3096743 0.1759867 -0.0292027 0.0530811 -0.0151477 -0.0763038 0.108283 0.0542955 -0.0005723 0.0114452 0.0312095 -0.0014884 0.0004734 -0.0029264 0.160252 0.0489414 0.019463 0.0043846 0.0363941 0.1062612 0.0057412 -0.0087003 -0.0248526 0.1605933 0.0062217 -0.0747836 -0.0095403 -0.0656857 0.0245806 -0.0083833 -0.0046788 -0.0086898 0.1578405 0.3523924 0.0637215 -0.0004083 0.0311374 0.3071158 0.002562 -0.0081875 -0.0004193 0.3510584 0.0134195 0.0137128 -0.0086159 0.015239 0.1084279 0.0054967 -0.008999 0.0047926 0.1800355 unknown
polarizability: 254.0371607|5.8738768|178.708749|13.4751104|2.2447733|67.0937492 unknown
InChI: InChI=1S/C10H5N5O4/c16-8-5-2-1-3-6(15(18)19)7(5)9(17)14(8)10-11-4-12-13-10/h1-4,13H
charge 0 multiplicity 1
24 atoms
O  -0.339441 -1.932731 0.109465
O  -1.332568 2.69182 -0.056266
O  2.313112 -2.464194 -0.887706
O  3.939887 -2.048504 0.667793
N  -1.205925 0.276316 -0.047122
N  -2.997149 -1.398532 -0.011196
N  2.930107 -1.702451 -0.058751
N  -3.62495 0.75033 -0.179718
N  -4.388519 -1.445815 -0.073675
C  1.12908 0.086459 0.002861
C  0.804615 1.463368 0.024793
C  -0.148052 -0.697245 0.01533
C  -0.682092 1.63379 -0.030779
C  2.484117 -0.286508 0.045841
C  1.778262 2.470751 0.091398
C  -2.564943 -0.085559 -0.077238
C  3.48925 0.70515 0.146287
C  3.137042 2.073197 0.162839
C  -4.706381 -0.122272 -0.172749
H  1.482836 3.524051 0.097342
H  4.535277 0.390885 0.20372
H  3.92641 2.827769 0.229015
H  -2.426978 -2.242594 0.068178
H  -5.737498 0.211518 -0.240865
