program: Gaussian 09
title: 000266739
version: EM64L-G09RevD.01
frameworkgroup: C1[X(C9H7NO4)]
method: RPBEPBE
basis: SDD
operation: Freq
keyword: #pfreq=noraman
keyword: PBEPBE/SDD
title: #p freq=noraman PBEPBE/SDD
converged: YES YES NO NO
title: Mulliken charges:
elementType: O O O O N C C C C C C C C C H H H H H H H
charge: -0.238780 -0.151828 -0.205381 -0.208765 0.018303 -0.534917 0.425281 -0.506675 0.176413 -0.563623 0.175588 -0.322252 0.405173 -0.363480 0.252882 0.250059 0.263817 0.261113 0.297016 0.275201 0.294855
chargesum: 0.00000
title: Mulliken charges with hydrogens summed into heavy atoms:
elementType: O O O O N C C C C C C C C C
charge: -0.238780 -0.151828 -0.205381 -0.208765 0.018303 -0.031975 0.425281 0.018254 0.176413 -0.266607 0.175588 -0.047051 0.405173 -0.068625
polarizability: 1.98646172e+02 -9.03213827e-01 1.19204191e+02 2.28754041e+00 -1.83490411e+00 5.45922358e+01
1716.lowfreq: -0.0010 -0.0007 -0.0007 3.8368 8.4209 13.2448 56.0264 61.4325 125.7144
frequency: 56.0051 61.4237 125.7133 143.3652 171.1264 224.3282 291.2963 317.2629 339.2330 405.1797 451.9332 471.0035 487.9443 528.6787 534.4038 559.0898 603.8415 667.6719 692.2678 715.4063 739.0957 757.3988 835.2511 852.7807 855.3690 901.1726 935.3618 987.6494 989.7532 1024.2764 1080.2059 1090.2413 1117.2128 1163.7975 1177.2139 1214.4852 1223.1905 1234.7891 1265.0703 1309.0586 1341.3406 1364.7925 1410.4878 1434.4867 1446.8449 1460.3276 1477.0092 1591.0534 1619.0784 1711.3000 2986.3828 2999.8038 3068.6158 3100.3322 3168.4073 3174.0262 3193.4923
redmass: 9.0640 10.7061 4.7165 5.2932 8.0845 2.7380 11.8555 4.8422 7.1729 3.1841 3.5077 5.5951 6.8472 4.7270 5.0806 3.7031 6.5598 4.4231 6.4608 4.6474 7.4847 3.6572 6.1598 1.6272 2.2151 4.6439 1.4106 1.4070 2.1712 2.1076 2.1201 4.2530 1.6901 1.1963 2.3408 5.4816 1.8557 2.4413 1.2990 1.3898 1.5912 9.2779 8.9617 3.5610 1.1003 1.2870 2.2263 7.5727 8.0987 11.9682 1.0679 1.0646 1.0962 1.0959 1.0925 1.0897 1.0971
irintensity: 6.2934 0.0604 3.2046 6.0802 3.7234 0.3404 0.0543 0.5685 1.3459 4.4322 13.5550 2.8307 1.6179 0.2147 3.5963 10.0955 5.7536 1.1468 19.2210 25.6067 20.5806 16.4961 50.6729 35.7907 96.2991 14.7643 26.5648 14.9556 102.5102 25.5237 106.3615 374.7339 28.0254 28.7883 51.4579 185.2294 10.4244 247.0509 2.7107 0.2650 1.6109 114.3815 4.5837 28.8530 18.6343 34.8443 67.1757 61.7171 62.4066 343.2122 10.8913 11.5758 10.7870 8.5316 1.9795 0.5515 2.4962
temp: 298.150 k
press: 1.00000 atm
elementType: 8 8 8 8 7 6 6 6 6 6 6 6 6 6 1 1 1 1 1 1 1
symmnumber: 1
zpe: 389673.5 jmol-1
zpe.correction: 0.148419 hartree
zpe.thermalcorrener: 0.159540 hartree
zpe.thermalcorrenthalpy: 0.160484 hartree
zpe.thermalcorrgfe: 0.110669 hartree
zpe.sumelectzpe: -701.732207 hartree
zpe.sumelectthermal: -701.721086 hartree
zpe.sumelectthermalent: -701.720142 hartree
zpe.sumelectthermalfe: -701.769957 hartree
dipole: -2.4314 1.9504 0.5954
dipole: 3.1734
quadrupole: -117.2960 -73.7851 -78.1692
quadrupole: -13.8080 -2.7346 -0.6078
quadrupole: -27.5459 15.9650 11.5809 -13.8080 -2.7346 -0.6078
hfenergy: -701.880626 hartree
pointgroup: C01 [X(C9H7N1O4)]
dipole: 0.9507026 0.7736288 -0.2375103 debye
dipolederiv: -2.2804022 -0.1052225 0.0433146 -0.6730577 -0.4354761 0.0715185 0.0785212 0.0860914 -0.2280599 -1.4808777 0.0671008 -0.0140854 0.196659 -0.4628764 0.0481954 -0.1127404 0.0538788 -0.3113134 -0.9014964 -0.1940307 -0.0272078 -0.2525492 -0.5771852 -0.0230888 -0.0380671 -0.0247289 -0.2304343 -0.6901924 0.1735931 -0.0038816 0.3042086 -0.7454209 -0.0178546 -0.0035461 -0.0174551 -0.2310535 2.0321971 -0.0989283 0.0475999 -0.2134275 1.0896807 0.0373346 0.0607916 0.0405021 0.1920777 0.0185077 -0.0403378 0.0163835 -0.0392794 0.0475006 -0.0018333 -0.0197039 -0.039303 0.1343614 -0.2741784 0.2102707 0.0457678 0.5556189 -0.0144132 0.0204812 0.0828571 0.0487221 -0.0742571 -0.0628542 0.0899894 -0.0121553 -0.0167526 -0.2051528 0.1020361 -0.0526655 0.1205577 0.0705341 1.5716202 -0.063101 0.0073412 -0.3910533 0.1595864 0.0252677 0.1117477 0.0039348 0.1123597 0.2904319 -0.1413518 0.007157 0.1267645 -0.0462961 0.0149847 -0.0004069 0.0046612 -0.0985344 2.5647059 0.0679409 0.005157 0.7759982 0.8850519 -0.2400889 -0.0303002 -0.2307487 0.2975937 -0.5524191 -0.0631371 0.0046784 -0.2453739 0.0726903 0.0030272 -0.0136937 -0.0058128 -0.1416711 -0.8805489 0.1178945 -0.0110349 0.1889163 -0.0303781 0.0010594 -0.0309684 -0.0057438 0.0543471 0.2624038 0.0002228 0.0102269 -0.2946852 0.011645 -0.0003833 0.0034913 0.0078309 -0.1095343 0.0192875 0.0919647 -0.0174957 0.0251698 -0.0621154 0.0430696 0.005472 0.0711237 0.0812701 0.0077118 -0.0644747 -0.0414294 -0.0353153 0.0735248 -0.0176297 -0.0320062 -0.0540207 -0.0823436 -0.0491348 -0.087109 -0.0016463 -0.0743385 0.0300995 -0.0027134 -0.0069157 -0.0260849 0.1170525 0.114802 0.0359462 -0.0516277 0.0387414 0.0754163 -0.0429313 -0.0007514 -0.0225241 -0.0562321 0.1277924 0.0215002 0.0015021 0.0031432 0.0373851 -0.0061446 0.0071008 0.0010073 0.1618985 0.077307 0.0436294 -0.0025493 0.0415839 0.0082449 -0.0087997 -0.0010358 -0.006163 0.1680944 0.0853367 -0.0623599 -0.0060148 -0.0209712 0.0884888 -0.005507 -0.0071805 -0.0057248 0.1738444 unknown
polarizability: 198.6304448|1.5072349|119.2347185|2.1952879|1.6176913|54.5774356 unknown
InChI: InChI=1S/C9H7NO4/c11-9-4-1-6-5-7(10(12)13)2-3-8(6)14-9/h2-3,5H,1,4H2
charge 0 multiplicity 1
21 atoms
O  2.203361 -1.059643 0.155916
O  4.415477 -0.474203 0.064987
O  -4.149603 -0.774262 -0.118381
O  -3.66531 1.452701 0.003975
N  -3.31522 0.208853 -0.040016
C  1.508156 1.735246 0.25467
C  0.433841 0.671328 0.136501
C  2.777366 1.286573 -0.508047
C  0.839521 -0.688915 0.07472
C  -0.943644 0.953695 0.095293
C  3.248124 -0.094542 -0.076535
C  -0.087413 -1.749184 -0.017876
C  -1.870685 -0.107561 0.0018
C  -1.462023 -1.459594 -0.053722
H  1.150793 2.700476 -0.142789
H  1.757725 1.900802 1.321916
H  3.61706 1.984103 -0.3620
H  2.564214 1.241791 -1.594797
H  -1.314343 1.982166 0.136919
H  0.282906 -2.777054 -0.057257
H  -2.2148 -2.248179 -0.125477
