program: Gaussian 09
title: 000266735
version: EM64L-G09RevD.01
frameworkgroup: C1[X(C7H13N2O5P)]
method: RPBEPBE
basis: SDD
operation: Freq
keyword: #p
keyword: freq=noraman
keyword: PBEPBE/SDD
title: #p freq=noraman PBEPBE/SDD
converged: YES YES NO NO
title: Mulliken charges:
elementType: P O O O O O N N C C C C C C C H H H H H H H H H H H H H
charge: 1.325427 -0.457923 -0.459909 -0.575324 -0.189646 -0.191182 -0.491706 0.131199 -0.025192 -0.440223 0.215335 -0.696417 -0.332112 -0.333277 -0.678819 0.282349 0.250333 0.274612 0.224360 0.232485 0.225026 0.270103 0.222018 0.222494 0.270360 0.226106 0.249706 0.249816
chargesum: 0.00000
title: Mulliken charges with hydrogens summed into heavy atoms:
elementType: P O O O O O N N C C C C C C C
charge: 1.325427 -0.457923 -0.459909 -0.575324 -0.189646 -0.191182 -0.491706 0.131199 0.257156 0.084723 0.215335 -0.014545 0.160010 0.159577 0.046810
polarizability: 1.46495914e+02 -4.85000280e-01 1.18679250e+02 8.93604624e-01 -2.25530943e+00 1.14400476e+02
1716.lowfreq: -7.4435 0.0008 0.0015 0.0015 7.2316 9.7923 28.4088 31.1978 48.3558
frequency: 28.2071 30.9553 48.3400 62.4437 93.8811 135.8580 155.1757 181.2520 196.7028 216.2051 236.0471 244.7056 268.3042 272.2254 315.9393 338.6780 358.9239 388.0206 399.6074 409.6846 429.3716 508.1056 522.4228 530.2391 562.4187 652.2046 671.7141 684.5775 733.1497 762.7827 831.7429 833.8661 891.1255 896.1878 934.5817 969.8993 972.8344 983.7494 1013.6083 1026.8522 1068.2006 1074.5155 1086.4784 1123.9736 1144.9716 1152.5565 1169.1166 1208.3446 1217.5163 1247.3539 1273.2185 1285.1834 1347.5963 1366.3262 1379.5198 1396.0616 1399.5686 1408.3508 1434.6396 1440.0664 1458.5466 1466.1621 1469.1011 1474.1081 1478.5358 2988.5271 2998.1080 3009.9461 3015.3677 3080.8434 3082.2406 3085.9847 3101.2367 3104.1196 3105.9331 3117.0709 3119.4060 3192.2452
redmass: 4.6274 7.3438 5.2651 3.9339 5.9133 4.4470 4.8851 1.0406 1.1938 5.9528 3.1909 2.8845 4.4418 5.2881 4.1749 4.7103 2.7836 3.5378 3.4704 4.2169 5.6073 4.7976 5.3773 5.0769 5.7930 9.3724 9.5763 6.4846 4.5276 12.1035 3.6939 3.2172 1.8991 1.2775 3.7384 3.7075 2.3193 1.7243 1.9592 1.2974 1.4966 8.6703 3.7555 1.2902 1.4739 2.1700 1.7501 1.4197 12.2040 1.7312 2.0562 1.2192 1.1950 1.2460 1.4385 1.2031 1.4990 2.5817 1.5199 1.0945 1.0834 1.1414 1.0837 1.0480 1.0504 1.0359 1.0354 1.0641 1.0642 1.0575 1.0974 1.0918 1.1003 1.1013 1.0967 1.0997 1.1014 1.1181
irintensity: 1.1461 0.3075 0.8992 1.9579 2.6134 1.5185 3.1010 0.1020 0.0488 2.1701 2.2907 1.1196 19.0047 2.9625 0.6145 4.5553 16.6491 21.7933 4.9858 6.5803 15.2034 2.3516 5.3719 10.5302 20.5582 129.5335 96.5122 36.9258 9.2800 25.8094 165.9170 3.4247 11.0407 9.0116 10.0992 195.8708 26.6941 0.3046 100.0575 50.6785 13.9441 117.9471 15.8328 6.4301 10.3688 3.2440 7.7780 2.6092 70.0215 23.9173 0.8029 4.2458 13.2630 1.2754 9.3886 20.1811 32.9151 131.0739 19.0548 16.0224 15.4545 9.0835 6.9373 11.0531 17.9369 18.8636 5.3921 8.3272 46.4687 13.6065 11.9034 15.0664 11.3654 7.2091 21.1860 1.2146 1.8045 4.2525
temp: 298.150 k
press: 1.00000 atm
elementType: 15 8 8 8 8 8 7 7 6 6 6 6 6 6 6 1 1 1 1 1 1 1 1 1 1 1 1 1
symmnumber: 1
zpe: 552457.2 jmol-1
zpe.correction: 0.210420 hartree
zpe.thermalcorrener: 0.226843 hartree
zpe.thermalcorrenthalpy: 0.227787 hartree
zpe.thermalcorrgfe: 0.165407 hartree
zpe.sumelectzpe: -1100.057409 hartree
zpe.sumelectthermal: -1100.040987 hartree
zpe.sumelectthermalent: -1100.040043 hartree
zpe.sumelectthermalfe: -1100.102422 hartree
dipole: -3.3914 7.8318 2.9497
dipole: 9.0299
quadrupole: -92.7122 -102.2083 -97.6803
quadrupole: 4.4110 2.1040 -1.6439
quadrupole: 4.8214 -4.6747 -0.1467 4.4110 2.1040 -1.6439
hfenergy: -1100.2678293 hartree
pointgroup: C01 [X(C7H13N2O5P1)]
dipole: 1.417793 3.1606744 -0.7881352 debye
polarizability: 146.5174516|-0.4472889|118.0543351|0.5142592|2.694576|115.0038535 unknown
InChI: InChI=1S/C7H13N2O5P/c1-6-3-8(6)15(12)13-4-7(2,5-14-15)9(10)11/h6H,3-5H2,1-2H3
charge 0 multiplicity 1
28 atoms
P  0.907382 -1.117445 -0.0062
O  -0.264654 -1.025377 -1.289546
O  0.035974 -0.415504 1.32666
O  1.456064 -2.574035 0.268855
O  -3.454676 -0.796017 -0.753976
O  -3.216715 -0.259608 1.444747
N  2.045671 0.191014 -0.431875
N  -2.860088 -0.20195 0.21425
C  3.444707 0.163305 0.188881
C  3.261836 -0.172001 -1.27745
C  -1.664755 0.757688 -0.147917
C  3.984423 1.496955 0.660978
C  -0.981933 0.261714 -1.442117
C  -0.695655 0.843299 1.052478
C  -2.317547 2.139749 -0.394717
H  3.65045 -0.698254 0.840015
H  3.502682 0.575597 -2.039612
H  3.379151 -1.219453 -1.581615
H  3.708607 2.302745 -0.040738
H  3.583113 1.751027 1.658122
H  5.086934 1.457769 0.733956
H  -1.730769 0.059536 -2.221847
H  -0.272742 1.044143 -1.773794
H  0.028808 1.654634 0.847613
H  -1.249306 1.040035 1.982232
H  -1.54402 2.878779 -0.666492
H  -3.050435 2.082654 -1.217727
H  -2.835709 2.493101 0.513135
