program: Gaussian 09
title: 000266726
version: EM64L-G09RevD.01
frameworkgroup: C1[X(C8H7N3O4)]
method: RPBEPBE
basis: SDD
operation: Freq
keyword: #pfreq=noraman
keyword: PBEPBE/SDD
title: #p freq=noraman PBEPBE/SDD
converged: YES YES NO NO
title: Mulliken charges:
elementType: O O O O N N N C C C C C C C C H H H H H H H
charge: -0.169208 -0.181693 -0.192723 -0.186954 -0.272018 0.010947 0.131799 0.321657 0.293986 -0.290138 -0.343990 -0.211831 -0.206458 0.224231 -0.769581 0.266967 0.287235 0.249326 0.250860 0.267294 0.244566 0.275728
chargesum: 0.00000
title: Mulliken charges with hydrogens summed into heavy atoms:
elementType: O O O O N N N C C C C C C C C
charge: -0.169208 -0.181693 -0.192723 -0.186954 -0.272018 0.010947 0.131799 0.321657 0.293986 -0.023171 -0.056755 0.037494 0.044402 0.224231 0.018008
polarizability: 1.62498747e+02 -4.24104289e+00 1.25007374e+02 -7.89387360e-02 2.51017731e+00 9.42095433e+01
1716.lowfreq: -10.1147 -7.2046 0.0008 0.0011 0.0011 0.4570 18.0978 50.3817 67.8288
frequency: 18.0671 50.3673 67.8250 84.3562 107.0434 122.0976 138.7564 173.3436 219.9868 251.4294 267.2023 333.2961 364.8234 374.7009 411.5124 468.2781 484.1936 539.8006 560.9420 573.0028 606.5038 639.6600 667.0792 709.7987 719.7057 778.3962 787.7598 827.3177 893.0931 969.2375 975.3718 1001.0896 1006.3280 1035.5380 1038.7780 1074.7938 1136.0367 1166.4932 1177.7657 1212.6408 1253.1522 1271.8881 1365.4362 1377.6631 1383.9105 1416.4656 1433.7883 1447.2204 1459.7162 1466.9487 1578.6308 1599.2398 1657.8005 2998.8951 3089.3267 3135.8712 3147.6504 3159.3531 3172.4346 3185.2861
redmass: 11.8888 7.0604 6.0880 6.3239 2.6463 1.4096 4.5759 6.2551 10.6640 8.4351 5.7288 10.3790 4.3050 8.8732 4.3084 6.4795 4.7732 4.1151 5.8773 4.2740 4.5644 6.7442 5.6358 5.9946 5.0863 2.0454 3.7697 3.5657 1.4895 1.6989 2.2687 1.5603 2.4254 2.6628 1.6894 2.9123 1.8915 2.5517 1.1548 9.1379 2.4835 2.1751 3.1178 1.8421 5.2990 8.9880 2.3887 1.0713 1.0591 2.7569 6.6798 6.8152 9.7677 1.0365 1.0976 1.1001 1.0873 1.0912 1.0953 1.0996
irintensity: 0.4572 1.1117 3.1106 1.1111 1.0232 0.6493 1.1364 0.3836 1.2867 0.9986 2.4860 1.1884 8.8449 3.4715 1.4778 3.7390 25.2509 1.8916 11.6894 2.8631 46.7366 6.4064 27.9772 29.7691 110.4275 4.7010 60.5801 137.2886 0.8399 32.0801 75.7658 0.7924 3.2877 1.8516 10.7828 21.8266 5.9612 204.3797 23.7746 195.8913 83.5110 58.9193 134.3095 61.8880 6.1655 109.7403 7.1789 24.8870 23.4092 70.3090 16.8707 17.8087 198.3096 2.0391 4.1017 8.0362 0.9353 5.2703 3.6015 7.4150
temp: 298.150 k
press: 1.00000 atm
elementType: 8 8 8 8 7 7 7 6 6 6 6 6 6 6 6 1 1 1 1 1 1 1
symmnumber: 1
zpe: 386603.7 jmol-1
zpe.correction: 0.147250 hartree
zpe.thermalcorrener: 0.161281 hartree
zpe.thermalcorrenthalpy: 0.162225 hartree
zpe.thermalcorrgfe: 0.104666 hartree
zpe.sumelectzpe: -772.954218 hartree
zpe.sumelectthermal: -772.940187 hartree
zpe.sumelectthermalent: -772.939243 hartree
zpe.sumelectthermalfe: -772.996802 hartree
dipole: 5.1125 -5.4115 -3.6322
dipole: 8.2834
quadrupole: -89.6791 -85.3920 -88.8451
quadrupole: -4.9710 2.1421 0.3139
quadrupole: -1.7070 2.5801 -0.8731 -4.9710 2.1421 0.3139
hfenergy: -773.1014679 hartree
pointgroup: C01 [X(C8H7N3O4)]
dipole: -2.3081714 1.7944879 -1.4397462 debye
dipolederiv: -1.1529293 -0.0669397 0.2053735 -0.0658531 -0.2755453 -0.0137887 -0.0090875 -0.0107309 -0.4679158 -0.5252816 -0.1453039 0.1435482 -0.2357047 -0.7646657 0.1229876 0.1688989 0.1052962 -0.2623182 -0.5985795 0.1131191 0.2063657 0.1048573 -0.5206634 -0.0395974 0.1890501 0.049931 -0.2996164 0.0805981 0.0037678 0.8510192 -0.0240265 -0.1079673 0.0374873 -0.0583375 0.0346374 -0.9974631 -0.9392952 -0.0570868 -0.1611449 0.0084698 -0.1124917 0.1391279 0.3385972 0.0760486 -1.5964094 0.9187416 -0.1547632 -0.405285 0.0533019 1.5010917 -0.1281816 -0.3642369 -0.1747843 0.3154816 -0.2151907 -0.0295748 -0.2526036 -0.01008 -0.0169121 -0.1661921 0.3047921 -0.1017926 1.9091078 0.6509947 0.1521132 0.1777234 -0.1187286 0.3022846 -0.0049959 0.0291248 -0.0721166 -0.1496663 -0.0060038 0.1844431 0.0330555 0.0406935 -0.4639218 0.034767 0.0744289 0.0306463 0.0723961 -0.2596419 0.16812 -0.0552218 0.2116478 -0.0449012 0.0197498 0.0173043 0.0265024 -0.0882402 -0.1014857 -0.1383837 -0.0174347 0.1285996 0.0669517 -0.0075831 -0.0293648 0.0457656 -0.0726626 0.1445558 -0.0949595 0.023343 -0.0036569 0.1628713 0.010996 0.0293189 -0.0050447 -0.0944017 0.134343 -0.0337016 0.0073251 -0.1620539 -0.1834236 -0.0219957 -0.002959 0.0087046 -0.134619 1.6987011 0.1187299 -0.6200419 0.1048063 0.1861647 0.0334333 -0.6303183 0.0074711 1.4161905 -0.0640642 -0.0332796 -0.1719907 -0.0493316 -0.0061908 -0.0420766 -0.0198131 -0.0139934 -0.4042565 0.0338065 -0.0779637 -0.0023726 -0.052901 0.0287648 -0.0014471 -0.0237486 0.0029176 0.1335064 0.0937173 -0.0169231 -0.0161443 -0.0538097 0.0568883 -0.0022538 0.0197265 -0.0149386 0.1669586 0.0647759 0.0546159 -0.0127235 0.0695444 -0.0443765 0.0091236 -0.0050399 0.0032127 0.1529663 -0.0685373 0.0294359 -0.0157503 0.0172692 0.0851705 0.0015408 -0.0195809 -0.0014678 0.1558757 -0.0186403 -0.0096057 0.1163193 -0.0121693 0.1311527 0.014065 0.0502311 0.0024832 0.0227901 0.0423775 0.1027694 -0.0221753 0.1128011 0.0084155 0.0248072 -0.0150554 -0.0234739 0.0903202 0.087038 -0.0686288 -0.0111842 -0.0636757 0.0113037 -0.0199733 -0.0439308 0.0247264 0.1319761 unknown
polarizability: 162.5406763|-1.5145515|123.7099447|-5.2166704|-5.5000178|95.465044 unknown
InChI: InChI=1S/C8H7N3O4/c1-6(12)10(9-13)7-4-2-3-5-8(7)11(14)15/h2-5H,1H3
charge 0 multiplicity 1
22 atoms
O  3.411618 0.558901 -0.573229
O  -1.400168 -2.828136 0.466585
O  0.556369 -2.163539 -0.501308
O  0.835055 0.258995 2.443443
N  1.186194 0.467307 0.190416
N  -0.617252 -1.924907 -0.015381
N  1.72091 0.319474 1.552887
C  -0.229123 0.584106 -0.031742
C  -1.117099 -0.527263 -0.046677
C  -0.789897 1.883296 -0.0748
C  -2.515059 -0.350837 -0.123147
C  -2.184732 2.069704 -0.178134
C  -3.04944 0.9501 -0.200014
C  2.1999 0.480192 -0.85589
C  1.649208 0.380265 -2.265308
H  -0.114476 2.743121 -0.014082
H  -3.157409 -1.235867 -0.118683
H  -2.594409 3.083652 -0.224042
H  -4.13261 1.088942 -0.268557
H  2.490999 0.429274 -2.97105
H  0.935189 1.192615 -2.487894
H  1.122132 -0.583094 -2.384594
