program: Gaussian 09
title: 000266724
version: EM64L-G09RevD.01
frameworkgroup: C1[X(C8H6Cl2N2O2)]
method: RPBEPBE
basis: SDD
operation: Freq
keyword: #p
keyword: freq=noraman
keyword: PBEPBE/SDD
title: #p freq=noraman PBEPBE/SDD
converged: NO YES NO NO
title: Mulliken charges:
elementType: Cl Cl O O N N C C C C C C C C H H H H H H
charge: 0.001055 -0.025019 -0.173770 -0.179939 -0.285306 0.131710 0.566990 -0.307636 -0.281878 -0.088503 -0.188915 -0.211813 0.203383 -0.762709 0.284276 0.268085 0.268712 0.268414 0.252196 0.260667
chargesum: 0.00000
title: Mulliken charges with hydrogens summed into heavy atoms:
elementType: Cl Cl O O N N C C C C C C C C
charge: 0.001055 -0.025019 -0.173770 -0.179939 -0.285306 0.131710 0.566990 -0.307636 0.002398 -0.088503 0.079170 0.056899 0.203383 0.018568
polarizability: 1.70638309e+02 -1.95114481e+00 1.20018585e+02 -4.51511770e-01 -2.36815258e+00 9.22918386e+01
1716.lowfreq: -11.9596 -8.5737 -3.2692 -0.0017 -0.0013 0.0002 15.7316 49.2612 78.5688
frequency: 14.9779 49.1915 78.5612 88.2384 94.4142 150.8626 154.0466 214.9742 216.3883 228.5701 304.2509 310.6317 315.4656 360.5065 369.2878 448.4033 465.5113 527.1524 540.9713 557.1597 579.3362 616.6623 670.0448 696.5244 762.5408 816.6165 830.0274 895.8558 951.4216 975.9054 1006.1371 1036.2751 1049.5860 1076.5719 1134.7391 1170.5392 1241.9487 1263.8388 1364.2926 1373.4278 1381.0667 1427.3440 1444.8851 1449.2005 1464.0511 1563.2612 1585.6033 1655.2166 2998.2486 3086.9971 3133.8561 3167.1580 3171.7727 3185.3149
redmass: 14.1397 4.4925 6.5441 7.2202 9.2665 7.8637 1.0968 11.7703 9.8964 5.7315 8.4576 23.3174 5.9863 12.1093 4.1406 3.7058 5.4944 5.1820 4.5307 6.3497 4.5466 5.1046 7.2006 4.9676 8.5089 1.3372 4.2190 1.6096 1.3510 3.0233 3.5412 1.7126 5.4619 1.8709 1.5288 2.9880 1.4527 3.3533 10.4720 3.2152 1.2923 7.0900 1.2879 2.0604 1.0488 7.1627 8.1971 9.7553 1.0371 1.0974 1.1001 1.0892 1.0936 1.0978
irintensity: 0.1238 5.0013 0.8618 0.3452 1.0052 0.3654 0.1074 0.1645 0.8566 2.4541 1.4911 0.1530 1.8516 4.7116 11.5717 18.5659 10.3863 7.0112 13.9401 18.7797 17.8585 26.9082 16.8016 80.7844 148.6720 48.8831 35.5940 25.3913 0.5957 116.1019 65.6672 6.2110 43.7918 40.1208 10.5105 229.1096 17.2487 86.2122 0.3018 47.8989 40.8716 112.2590 20.0247 106.2365 24.4298 12.3061 18.0966 214.6954 1.5699 4.5055 9.1057 0.1074 0.6111 0.3404
temp: 298.150 k
press: 1.00000 atm
elementType: 17 17 8 8 7 7 6 6 6 6 6 6 6 6 1 1 1 1 1 1
symmnumber: 1
zpe: 333254.7 jmol-1
zpe.correction: 0.126930 hartree
zpe.thermalcorrener: 0.140861 hartree
zpe.thermalcorrenthalpy: 0.141805 hartree
zpe.thermalcorrgfe: 0.083863 hartree
zpe.sumelectzpe: -1487.436016 hartree
zpe.sumelectthermal: -1487.422085 hartree
zpe.sumelectthermalent: -1487.421141 hartree
zpe.sumelectthermalfe: -1487.479082 hartree
dipole: 3.5882 2.7456 -3.3883
dipole: 5.6475
quadrupole: -106.8157 -90.7512 -97.1868
quadrupole: -2.6006 3.7425 1.9077
quadrupole: -8.5645 7.5000 1.0644 -2.6006 3.7425 1.9077
hfenergy: -1487.5629455 hartree
pointgroup: C01 [X(C8H6Cl2N2O2)]
dipole: -1.6919056 -0.3788366 -1.3895284 debye
dipolederiv: -0.3425605 0.3165711 0.0578609 0.2810984 -0.4399896 -0.0677664 0.0617953 -0.0649958 -0.0547701 -0.4919976 0.3249578 0.0433858 0.4008583 -0.4500796 -0.0648895 0.060675 -0.0672627 -0.0566836 -1.1340525 -0.2273796 0.2066724 -0.201371 -0.3306572 0.0608289 0.0037674 0.019357 -0.4827916 -0.015177 -0.0392895 0.7625814 0.0510425 -0.1092283 0.2447365 -0.0522735 0.0575107 -1.0196942 -0.7931541 -0.0952623 -0.1997865 -0.1729154 -0.185799 0.0714819 0.3805746 0.2095365 -1.6208225 -0.1188933 -0.0254578 -0.1209705 -0.062223 -0.0287222 -0.1822197 0.2862948 -0.0937407 1.9312273 0.5075176 0.2000572 0.1466789 0.1244937 0.1290905 0.0244331 0.0113468 0.0215006 -0.1202325 0.3720233 -0.5722565 -0.1367849 -0.450787 0.5705124 0.1149831 -0.0561054 0.1138034 -0.0399806 -0.2792899 0.1189667 -0.0041087 0.1207431 -0.151644 -0.0191291 0.0754879 0.0089208 -0.0494157 0.6982788 -0.5967279 -0.1037131 -0.6533069 0.6377275 0.1144555 -0.0923101 0.1211439 -0.0222171 -0.0917047 0.148442 0.0330566 0.109509 -0.0670893 -0.0099062 0.0222676 0.005051 -0.0704906 -0.099105 0.1185334 0.021597 0.141157 -0.1296289 0.0075702 0.0188325 -0.0028487 -0.0988441 1.6090418 0.39405 -0.5762518 0.3806459 0.2965722 -0.2114256 -0.6316268 -0.253926 1.4406453 -0.0823877 -0.0219239 -0.1742221 -0.0341957 -0.0057053 -0.0398412 -0.042187 0.0117795 -0.4026121 0.0880672 -0.0205059 -0.0060314 -0.0258637 0.0307873 -0.0182434 -0.0210899 -0.0265521 0.1314252 0.0757668 -0.008601 -0.0110008 -0.0253441 -0.0028668 -0.0372645 -0.0117674 -0.0391701 0.1528642 -0.0135066 -0.0141523 -0.0133662 -0.004431 0.0957448 -0.0152122 -0.0112457 -0.0168359 0.1616864 -0.002918 -0.0508426 0.1043342 -0.0445663 0.1134933 0.053437 0.0499871 0.0308653 0.0219331 -0.0004636 0.0966508 -0.0114138 0.1117635 0.0587658 0.0082781 -0.0068316 -0.0404403 0.0896332 0.1145151 -0.0458295 -0.0185174 -0.0463071 -0.0312834 -0.0343062 -0.0455914 0.0063038 0.1091398 unknown
polarizability: 165.9296999|-14.1718013|122.2602658|-4.2715206|8.9800129|94.7587676 unknown
InChI: InChI=1S/C8H6Cl2N2O2/c1-5(13)12(11-14)8-4-6(9)2-3-7(8)10/h2-4H,1H3
charge 0 multiplicity 1
20 atoms
Cl 0.700363 -2.641757 -0.463443
Cl -3.640284 2.032002 0.28924
O  3.449207 0.858459 -0.574648
O  1.039334 0.088502 2.501568
N  1.306806 0.311299 0.241706
N  1.87819 0.340461 1.601322
C  -0.081346 0.002064 0.036015
C  -0.517914 -1.313168 -0.257958
C  -1.047078 1.022987 0.21578
C  -2.410298 0.713617 0.069776
C  -1.885657 -1.61235 -0.402446
C  -2.847171 -0.590468 -0.238192
C  2.254566 0.598316 -0.822732
C  1.663568 0.554634 -2.221762
H  -0.719883 2.035774 0.467654
H  -2.201425 -2.632818 -0.635479
H  -3.912655 -0.811555 -0.343888
H  2.438855 0.881577 -2.92998
H  0.778541 1.207932 -2.314197
H  1.351581 -0.473509 -2.479934
