program: Gaussian 09
title: 000266708
version: EM64L-G09RevD.01
frameworkgroup: C1[X(C18H19NO4)]
method: RPBEPBE
basis: SDD
operation: Freq
keyword: #p
keyword: freq=noraman
keyword: PBEPBE/SDD
title: #p freq=noraman PBEPBE/SDD
converged: YES YES NO NO
title: Mulliken charges:
elementType: O O O O N C C C C C C C C C C C C C C C C C C H H H H H H H H H H H H H H H H H H H
charge: -0.489348 -0.465906 -0.432140 -0.223063 -0.630230 0.095290 0.097381 0.289618 -0.677663 -0.599094 0.379875 0.397832 0.127677 -0.407902 -0.401421 -0.390127 -0.384649 -0.243410 -0.269735 -0.241472 -0.237169 -0.239985 -0.238747 0.261347 0.263997 0.247025 0.257624 0.296540 0.292558 0.359656 0.368168 0.256835 0.253605 0.298459 0.274576 0.382671 0.227490 0.229085 0.229670 0.225319 0.230615 0.229147
chargesum: 0.00000
title: Mulliken charges with hydrogens summed into heavy atoms:
elementType: O O O O N C C C C C C C C C C C C C C C C C C
charge: -0.129692 -0.097738 -0.049469 -0.223063 -0.041131 0.095290 0.097381 0.289618 -0.152319 -0.094445 0.379875 0.397832 0.127677 -0.151067 -0.147816 -0.091668 -0.110073 -0.015920 -0.040650 -0.011802 -0.011850 -0.009371 -0.009600
polarizability: 2.19822565e+02 1.67591949e+00 2.15046899e+02 -1.36904921e+01 1.29695131e+01 1.70945629e+02
1716.lowfreq: -7.6694 -0.0006 -0.0005 0.0007 1.1707 9.2885 38.5443 43.1041 48.7165
frequency: 38.5152 43.0731 48.7124 49.0155 64.5002 93.2314 101.1991 114.3857 167.8172 195.7718 220.2893 230.4283 248.5172 255.7058 268.7711 299.6042 311.2093 316.5940 331.2160 349.8563 375.0042 393.3467 402.4543 405.0879 416.4438 436.4371 486.8936 541.5084 547.3942 566.3069 580.5650 594.2086 612.6060 614.8891 618.7539 626.1031 646.0979 683.9142 693.0377 706.0840 711.2205 737.1468 760.9482 773.1307 782.6804 802.8388 826.8205 856.4689 863.4225 886.3684 909.8966 924.1107 936.5216 968.3014 979.4168 987.7928 989.5001 991.4828 993.2345 997.2794 1009.4056 1014.7654 1029.2245 1030.9114 1046.0756 1060.0454 1063.1640 1069.7070 1091.3426 1101.2120 1113.2964 1147.4579 1173.7786 1174.3589 1183.2697 1196.1483 1198.7838 1232.5531 1244.1042 1253.5181 1270.0689 1280.6029 1319.2962 1327.1011 1331.5292 1356.5346 1375.6413 1376.4293 1381.3518 1434.9826 1436.6766 1438.7914 1463.7304 1485.5165 1487.8678 1586.0230 1589.0232 1612.2991 1613.8089 1635.9226 1667.1717 3019.3146 3025.7401 3087.8217 3097.5042 3122.3967 3124.2185 3130.0991 3134.4536 3141.6798 3150.9445 3151.4370 3160.6574 3164.2859 3169.2793 3436.5393 3439.1806 3519.7600 3565.6847 3586.9113
redmass: 5.0993 4.2711 4.7236 9.0733 4.1980 5.6243 4.7085 4.0596 5.4785 4.6679 2.0451 2.0152 5.4286 4.3235 4.2203 3.1673 2.9911 1.8613 4.2413 2.8572 2.7772 2.7409 2.8537 2.8530 3.5730 3.7096 4.1355 3.0649 2.8990 2.3143 1.4980 1.5974 3.4324 4.8951 4.9533 4.0466 5.4210 3.8987 1.7134 1.7275 1.6852 4.8040 2.6440 2.2040 2.8401 3.5924 2.4599 1.2503 1.2547 2.4905 4.2241 1.4177 1.4523 2.3878 1.3900 1.7641 3.0475 4.7569 2.3843 1.3606 1.3930 4.5454 2.4774 2.1764 2.6039 3.5061 3.4964 2.5638 1.6639 1.7539 2.1121 1.2543 1.0534 1.0552 2.0315 1.1235 1.1510 1.8113 1.8687 1.4086 1.7547 1.7649 1.5691 1.4126 1.6038 2.1658 3.4641 4.9929 2.4224 2.0163 1.9907 1.2431 1.0999 2.2107 2.2477 5.9362 6.0331 5.8855 5.9924 1.0918 9.2420 1.0606 1.0614 1.1021 1.1035 1.0850 1.0847 1.0879 1.0888 1.0927 1.0930 1.0959 1.0945 1.1016 1.0996 1.0451 1.0634 1.0641 1.0972 1.0667
irintensity: 0.3684 2.0798 0.3153 1.9616 0.1546 0.5010 1.5977 4.4816 2.1330 2.8902 36.2653 65.0409 8.8975 1.2967 2.5520 23.7973 42.2347 15.3544 1.6620 16.2487 5.0345 10.3402 0.7050 3.7326 7.2743 4.1302 2.2436 66.5602 24.3299 9.4604 154.4274 45.3067 13.8321 9.5448 7.1419 5.7390 10.0473 50.2609 225.3238 72.7417 62.6345 14.2074 15.8848 74.2615 39.6670 19.4995 9.0921 0.8364 0.8312 35.8284 6.2999 10.4947 2.4298 21.9010 0.0229 2.6128 2.4621 0.8103 8.4843 1.6237 1.1815 56.6163 56.0265 19.2432 297.2750 7.0272 9.0302 1.7027 18.6312 13.0639 0.5376 28.0825 0.1383 0.3063 25.9354 4.8205 1.6999 11.7996 5.4422 46.1535 16.3144 15.6860 30.8798 6.2330 36.9671 22.1283 12.2534 4.6854 39.2725 9.3381 14.6420 27.5507 18.2666 12.2810 15.3080 0.9222 0.7145 1.6707 4.5961 21.4774 206.5596 16.5345 11.7954 4.7822 15.4182 1.8476 0.3925 5.4791 10.0930 18.8016 33.3555 11.0461 17.8653 31.6170 9.8395 4.8292 40.5551 28.3745 16.1779 13.4285
temp: 298.150 k
press: 1.00000 atm
elementType: 8 8 8 8 7 6 6 6 6 6 6 6 6 6 6 6 6 6 6 6 6 6 6 1 1 1 1 1 1 1 1 1 1 1 1 1 1 1 1 1 1 1
symmnumber: 1
zpe: 876297.7 jmol-1
zpe.correction: 0.333764 hartree
zpe.thermalcorrener: 0.354482 hartree
zpe.thermalcorrenthalpy: 0.355426 hartree
zpe.thermalcorrgfe: 0.284649 hartree
zpe.sumelectzpe: -1051.286116 hartree
zpe.sumelectthermal: -1051.265399 hartree
zpe.sumelectthermalent: -1051.264455 hartree
zpe.sumelectthermalfe: -1051.335232 hartree
dipole: 0.6764 0.3420 -0.8618
dipole: 1.1477
quadrupole: -120.9835 -128.2558 -135.6694
quadrupole: -7.1887 -5.7547 -1.0995
quadrupole: 7.3194 0.0471 -7.3665 -7.1887 -5.7547 -1.0995
hfenergy: -1051.6198806 hartree
pointgroup: C01 [X(C18H19N1O4)]
dipole: 0.2878131 -0.1164215 0.3278554 debye
polarizability: 220.0113445|-2.2971315|206.7440114|9.922894|23.3289668|179.0597371 unknown
InChI: InChI=1S/C18H19NO4/c19-16(15(20)21)11-17(22,13-7-3-1-4-8-13)18(23,12-16)14-9-5-2-6-10-14/h1-10,20,22-23H,11-12,19H2
charge 0 multiplicity 1
42 atoms
O  -0.951187 1.983564 -1.167992
O  0.190911 0.032345 -2.423666
O  -4.614169 -1.036251 -0.021146
O  -4.209973 1.19998 0.430977
N  -2.282112 -1.58805 1.294263
C  -0.336613 1.024974 -0.175351
C  -0.271283 -0.285115 -1.063765
C  -2.311291 -0.424887 0.375938
C  -1.385922 0.710205 0.918781
C  -1.779147 -0.703113 -1.081123
C  0.975312 1.63677 0.309646
C  0.62422 -1.424874 -0.562774
C  -3.768373 0.041654 0.290176
C  1.030699 2.356854 1.532315
C  1.141101 -1.520062 0.753181
C  2.13946 1.584302 -0.503471
C  0.905074 -2.473488 -1.477955
C  2.221078 3.001284 1.939255
C  1.908131 -2.641147 1.148083
C  3.328428 2.222791 -0.093969
C  1.673097 -3.589862 -1.08688
C  3.375385 2.935935 1.127433
C  2.174341 -3.6832 0.233136
H  -0.918895 0.359983 1.853694
H  -1.982934 1.606736 1.158505
H  -2.292206 -0.056101 -1.815565
H  -1.930688 -1.756742 -1.364595
H  -1.338372 -1.977443 1.402618
H  -2.971001 -2.306231 1.043387
H  -0.897378 2.899205 -0.797199
H  -0.23669 0.910245 -2.634443
H  0.146819 2.417766 2.17745
H  0.983924 -0.712342 1.474281
H  2.102668 1.031861 -1.448118
H  0.532286 -2.389459 -2.503364
H  -5.553628 -0.712769 -0.07288
H  2.245695 3.551177 2.886815
H  2.30406 -2.690739 2.16869
H  4.220799 2.164067 -0.727264
H  1.883554 -4.385136 -1.8110
H  4.300023 3.432592 1.442235
H  2.770399 -4.549977 0.539863
