program: Gaussian 09
title: 000266690
version: EM64L-G09RevD.01
frameworkgroup: C1[X(C13H17ClN2O4)]
method: RPBEPBE
basis: SDD
operation: Freq
keyword: #p
keyword: freq=noraman
keyword: PBEPBE/SDD
title: #p freq=noraman PBEPBE/SDD
converged: YES YES NO NO
title: Mulliken charges:
elementType: Cl O O O O N N C C C C C C C C C C C C C H H H H H H H H H H H H H H H H H
charge: -0.050385 -0.302777 -0.304274 -0.295839 -0.265109 -0.349791 -0.431596 -0.265490 0.544685 -0.417772 -0.394171 -0.206664 -0.214345 -0.107886 0.321388 0.286113 -0.255998 -0.255317 -0.660724 -0.662424 0.298808 0.326009 0.348848 0.257698 0.246230 0.259557 0.256747 0.217718 0.235557 0.237098 0.221482 0.212029 0.254609 0.224373 0.217015 0.223767 0.250834
chargesum: 0.00000
title: Mulliken charges with hydrogens summed into heavy atoms:
elementType: Cl O O O O N N C C C C C C C C C C C C C
charge: -0.050385 -0.302777 -0.304274 -0.295839 -0.265109 -0.023782 -0.082748 0.033318 0.544685 -0.160074 -0.147942 0.052893 0.042402 -0.107886 0.321388 0.286113 0.197276 0.203262 0.030286 0.029192
polarizability: 2.37477664e+02 4.72169259e+00 1.61127027e+02 6.59172402e-01 1.46204827e+01 1.42233308e+02
1716.lowfreq: -6.8818 -3.8736 -0.0013 0.0008 0.0015 2.1198 8.0663 11.7670 29.9164
frequency: 7.7757 11.6571 29.8884 33.2580 41.9466 50.1678 65.8805 73.1142 87.4014 90.2255 114.4648 161.4456 166.9585 208.0292 210.6337 229.3477 237.2823 276.5116 304.4334 309.6415 323.2079 330.5495 398.7265 405.8526 415.6735 437.8496 486.8117 502.1312 532.8681 561.5781 570.7728 626.4794 632.4165 666.0975 685.1675 703.2919 709.6771 726.3274 784.3412 802.6795 809.2634 827.0543 834.2519 836.6960 864.9777 948.3099 958.7862 967.3230 972.1456 999.8549 1020.5124 1026.1332 1072.2569 1087.0447 1094.8563 1096.3892 1114.5023 1126.6518 1153.7544 1156.1243 1176.0551 1185.9709 1211.3647 1216.1486 1281.0865 1281.4201 1285.0931 1313.6652 1345.6747 1356.8037 1363.6964 1386.2063 1389.0937 1391.2881 1406.3411 1448.2790 1455.1736 1457.9493 1462.2234 1463.7128 1476.3178 1480.3248 1484.5744 1485.3050 1589.2373 1601.7765 1649.9964 1668.2376 2991.4586 2991.6799 3026.6750 3027.5920 3036.1003 3086.4632 3086.5762 3091.0730 3091.1978 3117.3761 3117.4281 3121.0093 3147.4044 3170.0855 3176.0522 3568.7681 3571.4175
redmass: 4.1846 4.7886 3.4916 5.3390 3.9444 4.9334 4.8205 4.5705 3.7660 4.5665 6.6864 2.7146 4.0689 3.4858 2.6825 1.4095 2.7158 4.0112 3.0715 3.6057 4.7025 4.9036 3.6868 2.8544 3.8184 4.7616 2.6901 1.4463 1.2448 3.5688 3.5886 6.7738 4.9400 4.6260 5.2773 9.9674 10.0447 3.5155 2.7210 1.2300 1.4257 1.3867 2.2733 1.8589 3.3973 1.6922 2.4976 1.4271 3.1525 4.2690 3.7797 3.8745 3.0111 3.7983 2.1710 2.1589 1.6736 3.7311 1.7204 1.6923 2.2486 1.1272 2.2650 2.5087 1.1247 1.1112 1.4024 1.5450 1.3219 1.2626 1.3838 4.5273 1.2370 1.2370 2.0083 1.5690 1.1185 1.1521 1.0528 1.0862 1.8311 2.0268 1.0582 1.1449 7.1934 6.3101 8.7943 9.1229 1.0360 1.0363 1.0596 1.0598 1.0856 1.0973 1.0974 1.1034 1.1032 1.1054 1.1057 1.0898 1.0901 1.0950 1.0964 1.0777 1.0780
irintensity: 0.2706 0.0679 0.6864 0.1108 4.1916 1.7558 8.4413 5.5186 1.7707 0.3272 0.2395 0.6630 2.6696 2.2822 2.8792 7.4845 2.1969 3.0936 26.0757 15.6796 12.4815 4.2726 7.2508 0.2868 0.6358 10.9350 21.2455 129.9670 75.8159 1.9362 64.1930 0.1958 8.0837 22.4866 13.3078 14.9709 15.3676 11.6525 27.7476 3.5683 3.7154 25.4857 22.2359 28.6670 67.4222 23.9140 46.3098 1.3102 4.6902 63.8677 231.3325 135.6295 78.4183 26.6036 59.2779 14.8772 6.4280 79.6447 123.8163 19.3045 273.6015 7.4902 114.7801 109.7975 2.2878 6.4749 20.2275 35.9166 62.8584 5.1602 16.8275 5.2407 30.4651 29.4805 18.0522 345.0973 37.9721 133.5908 37.0507 87.6664 315.7162 18.8301 33.3994 72.1756 0.6610 15.9004 145.6292 350.1565 17.8443 23.8498 38.9841 30.1157 4.5156 51.8116 25.0543 1.8788 0.8886 33.3465 35.8943 12.4412 3.0365 3.5514 0.9654 40.6823 29.4388
temp: 298.150 k
press: 1.00000 atm
elementType: 17 8 8 8 8 7 7 6 6 6 6 6 6 6 6 6 6 6 6 6 1 1 1 1 1 1 1 1 1 1 1 1 1 1 1 1 1
symmnumber: 1
zpe: 757899.0 jmol-1
zpe.correction: 0.288668 hartree
zpe.thermalcorrener: 0.310253 hartree
zpe.thermalcorrenthalpy: 0.311197 hartree
zpe.thermalcorrgfe: 0.232050 hartree
zpe.sumelectzpe: -1374.561834 hartree
zpe.sumelectthermal: -1374.540250 hartree
zpe.sumelectthermalent: -1374.539305 hartree
zpe.sumelectthermalfe: -1374.618453 hartree
dipole: 1.3910 -1.7858 -2.5115
dipole: 3.3811
quadrupole: -128.8165 -112.2599 -121.4305
quadrupole: -3.8236 -5.2025 -1.0577
quadrupole: -7.9808 8.5757 -0.5949 -3.8236 -5.2025 -1.0577
hfenergy: -1374.8505024 hartree
pointgroup: C01 [X(C13H17Cl1N2O4)]
dipole: -0.7159799 0.3113156 -1.0770247 debye
polarizability: 210.2777747|37.3320089|185.7777774|14.5352965|-8.9123225|144.7824476 unknown
InChI: InChI=1S/C13H17ClN2O4/c1-3-19-12(17)15-11(16-13(18)20-4-2)9-5-7-10(14)8-6-9/h5-8,11,15-16H,3-4H2,1-2H3
charge 0 multiplicity 1
37 atoms
Cl 5.015507 3.747929 0.320765
O  0.56587 -3.164551 -0.986601
O  -3.392995 1.59717 -0.513163
O  0.815914 -2.300771 1.20132
O  -2.854435 -0.388902 0.651726
N  0.114182 -0.972096 -0.597381
N  -1.211972 1.015997 -0.277074
C  -0.063956 0.249001 0.215338
C  1.186919 1.132592 0.230083
C  1.94643 1.248929 1.417182
C  1.620061 1.815066 -0.935718
C  3.115638 2.041715 1.454765
C  2.782183 2.615693 -0.915702
C  3.511585 2.717614 0.285774
C  0.518749 -2.151956 -0.013799
C  -2.511975 0.6371 0.015268
C  0.925484 -4.520251 -0.479284
C  -4.844197 1.315864 -0.309195
C  -0.309415 -5.250546 0.055328
C  -5.384794 0.393328 -1.404991
H  -0.269212 -0.112705 1.239448
H  -0.103655 -0.956593 -1.5942
H  -1.065941 1.934179 -0.697976
H  1.634464 0.705266 2.315307
H  1.067201 1.716027 -1.878444
H  3.704377 2.128549 2.37214
H  3.117661 3.143224 -1.813084
H  1.354469 -5.020987 -1.3624
H  1.694897 -4.408718 0.305132
H  -4.977544 0.868856 0.69175
H  -5.307086 2.315241 -0.342676
H  -0.035583 -6.279973 0.353742
H  -0.715253 -4.731237 0.939635
H  -1.096678 -5.311178 -0.715921
H  -6.477425 0.271099 -1.284306
H  -5.193756 0.816199 -2.406588
H  -4.918517 -0.604071 -1.339695
