program: Gaussian 09
title: 000266689
version: EM64L-G09RevD.01
frameworkgroup: C1[X(C12H16N2O4S)]
method: RPBEPBE
basis: SDD
operation: Freq
keyword: #p
keyword: freq=noraman
keyword: PBEPBE/SDD
title: #p freq=noraman PBEPBE/SDD
converged: YES YES NO NO
title: Mulliken charges:
elementType: S O O O O N N C C C C C C C C C C C C H H H H H H H H H H H H H H H H
charge: 0.940915 -0.407971 -0.217446 -0.549114 -0.546116 -0.449390 -0.713213 0.300979 -0.501477 -0.544955 -0.438811 -0.428753 0.096245 0.481696 -0.429565 -0.310991 -0.203387 -0.271950 -0.083648 0.258487 0.244183 0.237146 0.235223 0.222221 0.225716 0.217397 0.235534 0.298139 0.230432 0.268496 0.387803 0.276969 0.282054 0.333889 0.323266
chargesum: 0.00000
title: Mulliken charges with hydrogens summed into heavy atoms:
elementType: S O O O O N N C C C C C C C C C C C C
charge: 0.940915 -0.020168 -0.217446 -0.549114 -0.546116 -0.151251 -0.056057 0.300979 0.001192 -0.072586 0.009126 0.024177 0.096245 0.481696 -0.199133 -0.042496 0.073581 0.010104 -0.083648
polarizability: 2.59726350e+02 -1.26006240e+00 1.45364028e+02 1.22373719e+00 -1.42076937e+01 1.57415035e+02
1716.lowfreq: -14.4762 -7.5676 -3.7890 -0.0014 -0.0014 0.0006 16.0958 25.5759 31.0352
frequency: 14.9050 25.4093 30.9404 38.6912 68.7586 73.5501 87.2968 111.3266 137.4611 154.1492 173.5704 214.5511 235.0613 239.8746 257.9366 282.9893 317.1369 340.6408 349.7124 367.8307 374.6640 415.7195 421.6160 427.0273 455.6847 487.2763 534.9371 536.9667 568.9329 599.4203 616.5339 625.9296 652.2856 704.9885 724.5621 732.0815 795.1165 806.4876 816.6247 820.3399 824.9554 835.0939 859.7489 897.1816 907.3078 909.8614 944.0881 955.1828 970.3755 980.9577 981.9998 1032.3821 1045.2723 1052.8053 1059.2290 1067.7311 1075.5184 1115.8148 1134.1629 1172.7113 1191.9096 1209.7007 1231.4884 1249.5988 1283.6765 1293.9104 1304.5744 1308.0504 1313.4009 1321.5657 1327.1949 1372.3559 1427.8639 1461.7793 1463.5677 1468.2305 1479.5314 1485.2077 1502.3694 1531.8234 1587.9781 1609.5924 1645.6354 3001.8419 3002.4080 3006.0315 3030.7349 3062.9608 3065.7691 3079.8208 3098.5506 3128.7757 3151.9968 3164.9872 3174.4688 3354.3132 3515.4459 3521.7251 3546.9836
redmass: 5.2935 3.4769 4.1575 10.6989 3.6245 3.9507 4.2166 1.8582 6.4603 2.7426 4.7627 5.1222 3.0438 3.1944 3.2853 5.1678 5.4891 3.0958 5.4503 2.9163 4.7073 2.3342 5.5733 2.1555 4.6626 4.5981 2.6750 2.4210 2.1842 1.6629 4.9402 4.2613 4.2911 3.4050 3.0592 3.0139 5.5190 2.1279 1.8551 1.4312 2.2311 1.6825 2.0336 2.0495 4.1789 2.7388 2.2920 1.3524 1.3443 4.7469 2.5500 1.6940 2.7290 2.1575 2.3564 1.4726 1.8246 2.2372 1.4533 1.6925 1.1321 1.7371 1.3698 1.4403 1.6071 1.3420 1.5866 1.2681 1.6486 1.4820 1.6763 3.5459 4.5055 1.2504 1.0829 1.0905 1.3206 1.3771 2.0029 1.0866 5.4332 6.2085 9.4323 1.0597 1.0613 1.0655 1.0616 1.1006 1.1014 1.1051 1.1048 1.0894 1.0889 1.0954 1.0955 1.0414 1.0642 1.0994 1.0768
irintensity: 0.4359 0.9884 0.8319 1.0289 3.8870 4.5329 9.7623 24.1019 2.3421 0.6822 3.9473 0.8384 1.6604 4.2647 0.8458 8.0070 1.2197 17.6033 10.3040 40.1559 4.0836 32.1037 102.9680 13.9356 25.6648 174.6575 39.9943 23.5037 15.5117 116.6918 18.4071 24.6050 21.6515 14.5632 0.2406 6.7248 33.3291 54.9196 131.6642 15.1298 49.9659 53.3653 6.4806 9.9789 63.0406 12.8383 45.3781 0.2695 1.5519 8.4620 14.7486 38.6472 15.4424 104.5971 74.8102 30.0974 27.9357 15.8513 5.7636 4.4852 30.1308 22.5738 0.5137 13.7806 10.0785 1.5888 15.2033 7.8882 30.8274 2.5322 63.7156 98.7840 0.5600 26.8770 1.0196 10.3051 7.1271 66.9426 134.5174 15.3787 5.2948 313.7888 165.5634 31.5261 35.6396 22.3832 13.0865 16.1020 26.0873 42.3165 33.1025 11.1577 1.1705 2.8718 12.6681 21.4023 33.7000 19.6809 43.2053
temp: 298.150 k
press: 1.00000 atm
elementType: 16 8 8 8 8 7 7 6 6 6 6 6 6 6 6 6 6 6 6 1 1 1 1 1 1 1 1 1 1 1 1 1 1 1 1
symmnumber: 1
zpe: 708423.7 jmol-1
zpe.correction: 0.269824 hartree
zpe.thermalcorrener: 0.289580 hartree
zpe.thermalcorrenthalpy: 0.290524 hartree
zpe.thermalcorrgfe: 0.218787 hartree
zpe.sumelectzpe: -1273.735305 hartree
zpe.sumelectthermal: -1273.715549 hartree
zpe.sumelectthermalent: -1273.714605 hartree
zpe.sumelectthermalfe: -1273.786342 hartree
dipole: 6.5217 -3.5978 0.6934
dipole: 7.4805
quadrupole: -126.3045 -120.7529 -117.0430
quadrupole: 9.7412 14.7168 4.0693
quadrupole: -4.9377 0.6139 4.3238 9.7412 14.7168 4.0693
hfenergy: -1274.0051293 hartree
pointgroup: C01 [X(C12H16N2O4S1)]
dipole: 2.6687112 1.2002042 0.3147423 debye
polarizability: 258.9858222|-5.118106|160.9290553|-8.2871506|-11.9213453|142.590536 unknown
InChI: InChI=1S/C12H16N2O4S/c13-19(17,18)10-5-3-9(4-6-10)14-12(11(15)16)7-1-2-8-12/h3-6,14-15H,1-2,7-8,13H2
charge 0 multiplicity 1
35 atoms
S  -4.383873 0.094756 0.350059
O  2.129125 -1.265842 -2.33307
O  2.709861 -2.645496 -0.561729
O  -5.174757 0.957197 -0.785253
O  -4.675422 -1.485471 0.633304
N  1.567665 0.781962 -0.563366
N  -4.708124 1.014935 1.925219
C  2.640784 -0.168347 -0.224399
C  2.766071 -0.396389 1.325869
C  4.012514 0.481499 -0.624409
C  4.060434 0.345332 1.783816
C  4.407845 1.307184 0.620017
C  2.489458 -1.497058 -1.002654
C  0.206457 0.58397 -0.344702
C  -0.710812 1.595051 -0.774732
C  -0.310544 -0.589254 0.288634
C  -2.090176 1.456473 -0.56512
C  -1.693939 -0.731906 0.502435
C  -2.553994 0.294117 0.079912
H  2.811284 -1.473888 1.55612
H  1.876418 0.022142 1.824032
H  3.936459 1.057563 -1.564586
H  4.75895 -0.31808 -0.786926
H  4.88488 -0.378758 1.924616
H  3.918207 0.873588 2.742191
H  3.798219 2.228188 0.681788
H  5.471506 1.60245 0.606275
H  1.822429 1.532033 -1.206929
H  -0.328152 2.492551 -1.275074
H  0.355212 -1.397147 0.602547
H  2.054893 -2.134851 -2.813168
H  -2.79632 2.219142 -0.907757
H  -2.102311 -1.636964 0.963691
H  -5.527346 1.622252 1.749205
H  -4.880901 0.319967 2.671742
