program: Gaussian 09
title: 000266681
version: EM64L-G09RevD.01
frameworkgroup: C1[X(C19H24N2O5)]
method: RPBEPBE
basis: SDD
operation: Freq
keyword: #p
keyword: freq=noraman
keyword: PBEPBE/SDD
title: #p freq=noraman PBEPBE/SDD
converged: YES YES NO NO
title: Mulliken charges:
elementType: O O O O O N N C C C C C C C C C C C C C C C C C C C H H H H H H H H H H H H H H H H H H H H H H H H
charge: -0.249220 -0.469714 -0.480510 -0.274440 -0.252606 -0.185343 -0.226854 -0.069234 -0.112348 -0.527071 0.004622 -0.416939 0.264486 -0.270107 -0.348704 0.192779 0.126076 -0.384954 -0.560438 -0.773643 0.498453 -0.415984 -0.406959 -0.228204 -0.229890 -0.244680 0.285688 0.247109 0.259159 0.271892 0.240912 0.228979 0.211501 0.333827 0.365520 0.244307 0.242741 0.240198 0.238526 0.210494 0.209597 0.366013 0.244158 0.216630 0.244695 0.234313 0.235854 0.221785 0.222102 0.225423
chargesum: 0.00000
title: Mulliken charges with hydrogens summed into heavy atoms:
elementType: O O O O O N N C C C C C C C C C C C C C C C C C C C
charge: -0.249220 -0.104194 -0.114496 -0.274440 -0.252606 -0.185343 -0.226854 0.216454 0.134761 0.003980 0.245534 0.023541 0.264486 0.063720 0.138343 0.192779 0.126076 0.093770 -0.140347 -0.068160 0.498453 -0.181670 -0.171105 -0.006419 -0.007788 -0.019257
polarizability: 2.90791197e+02 -7.76126592e+00 2.40426819e+02 -1.31231027e+01 2.78294764e+00 1.68147818e+02
1716.lowfreq: -3.6375 -3.2622 -0.0009 -0.0005 0.0005 4.6890 12.5556 15.6009 20.5353
frequency: 11.8843 15.5876 20.3148 36.5728 42.9466 48.9942 72.9236 76.7264 87.4516 101.1405 108.6676 114.1929 126.7923 138.1529 172.6917 190.6294 208.9908 229.4106 251.5516 264.5885 280.0963 302.6110 329.9602 332.6162 359.3975 370.3692 372.5811 391.1135 403.3665 422.0002 449.0024 466.5299 472.3631 489.0377 503.4170 516.7189 549.4692 578.4295 613.2035 617.5695 632.2900 647.9586 705.1885 713.9573 729.8239 747.9708 751.7113 762.1281 771.7662 802.0349 811.8881 834.7661 854.3629 876.2477 890.6118 916.8076 917.1755 946.9879 959.5126 967.0492 976.0993 983.5120 987.3898 989.9498 992.6178 1008.3201 1025.4152 1033.2558 1035.3520 1041.8748 1050.6145 1056.1842 1058.1068 1078.9631 1082.6044 1101.7581 1115.7496 1128.9897 1166.1695 1171.1804 1184.1076 1186.7884 1208.2953 1217.3946 1220.1663 1224.3579 1246.8826 1251.7662 1261.7441 1272.2194 1280.8436 1283.0619 1304.0461 1310.4609 1327.8158 1332.9550 1341.6064 1345.6490 1351.1911 1374.3238 1376.5037 1382.8670 1402.6518 1406.0518 1410.9732 1424.0268 1440.5237 1443.4935 1450.6805 1468.0416 1469.3576 1475.5407 1483.8958 1484.5368 1485.3599 1574.8465 1593.2229 1614.3467 1625.4317 1661.5341 2971.7312 2976.8327 2980.6830 2986.8474 3000.6758 3012.9647 3027.4115 3033.2711 3041.4354 3047.9532 3062.9803 3066.9247 3096.2482 3103.4495 3108.3803 3114.4369 3115.2780 3119.4111 3126.6533 3130.4594 3142.0971 3160.6807 3548.8826 3600.7833
redmass: 5.2585 4.0003 5.9300 6.0374 4.4800 4.3164 6.9514 4.8500 5.6403 2.0946 4.1902 2.3402 1.3534 5.8292 4.6018 3.2327 4.0765 1.3813 3.0609 4.0665 3.4111 3.6841 3.5767 2.4239 3.0908 4.4286 3.2014 4.3748 2.8221 6.1713 4.9499 5.4214 1.2215 4.5802 3.1840 4.3878 5.1477 4.5846 4.8622 6.3518 5.0165 4.3437 1.7518 9.1166 6.2748 5.5415 1.3180 2.0785 3.7233 2.8881 3.4248 1.5629 1.2593 2.5887 4.0709 1.5280 2.5985 4.0606 1.2843 6.9792 1.3882 2.7194 3.2174 6.0696 1.3151 2.3650 2.3842 2.2856 3.0340 2.0567 2.8184 2.5565 1.6145 1.9546 2.0705 1.7680 1.4941 3.4171 1.1733 1.0520 1.3522 1.1171 1.2230 2.3980 1.7596 1.3241 2.8601 2.8252 1.3655 1.3678 1.2466 1.2009 1.3786 1.4375 1.2541 1.4177 1.3508 1.9767 1.4583 1.4127 1.4752 7.5374 1.4449 1.2704 1.6220 1.8597 2.1711 1.1654 1.0440 1.0873 1.0987 1.0905 2.2383 1.0831 1.1144 9.2119 6.0429 6.1670 9.5763 5.9545 1.0616 1.0589 1.0780 1.0362 1.0588 1.0862 1.1015 1.0579 1.1075 1.0636 1.1044 1.0974 1.1006 1.1065 1.1016 1.0853 1.0880 1.0902 1.0969 1.0911 1.0960 1.1015 1.0657 1.0670
irintensity: 0.4837 0.1705 0.4124 0.4585 0.3451 0.4493 0.1108 5.6424 6.3111 0.3536 4.1922 3.3300 0.5659 4.7243 1.4801 23.6156 12.0237 93.7828 14.2393 1.8767 8.0616 4.3971 5.2353 0.5310 11.3214 15.1093 14.0723 11.8913 0.0090 13.9895 4.9782 19.0351 149.1904 36.6127 22.1267 9.2869 11.0851 24.5553 3.3891 0.0703 6.9705 6.6957 54.5596 0.8143 17.5193 17.7091 2.0119 52.1288 15.7140 0.6280 4.2103 5.1287 0.3146 26.5500 47.2603 20.4162 63.0533 1.9618 16.0315 99.2008 0.2912 81.6311 21.0038 0.9756 0.1988 34.2353 9.9859 3.8549 14.7913 16.1542 34.4020 12.4170 25.5077 8.3477 5.8146 14.8449 20.7025 56.9200 2.9744 0.0592 45.7929 0.2329 57.1512 0.6092 19.7604 16.9654 34.3506 178.3138 13.3915 17.3166 7.7977 2.5279 37.0110 6.6886 1.0001 5.7882 12.6434 89.8110 6.1988 10.5546 25.0888 0.0521 6.8435 24.2865 2.5947 64.1666 5.9083 65.1281 11.5847 16.3677 0.4115 8.1453 24.0722 6.3509 12.7631 405.8409 0.4981 11.1166 184.2488 209.3218 24.7420 27.2478 37.3392 24.6041 17.1844 43.5253 7.6468 25.4315 47.3641 20.0182 15.4885 14.4811 16.2075 3.7675 4.6116 10.5178 2.9019 7.6430 43.9326 13.3352 45.5835 25.9453 20.2058 8.8539
temp: 298.150 k
press: 1.00000 atm
elementType: 8 8 8 8 8 7 7 6 6 6 6 6 6 6 6 6 6 6 6 6 6 6 6 6 6 6 1 1 1 1 1 1 1 1 1 1 1 1 1 1 1 1 1 1 1 1 1 1 1 1
symmnumber: 1
zpe: 1066114.6 jmol-1
zpe.correction: 0.406062 hartree
zpe.thermalcorrener: 0.431426 hartree
zpe.thermalcorrenthalpy: 0.432370 hartree
zpe.thermalcorrgfe: 0.346700 hartree
zpe.sumelectzpe: -1222.110244 hartree
zpe.sumelectthermal: -1222.084879 hartree
zpe.sumelectthermalent: -1222.083935 hartree
zpe.sumelectthermalfe: -1222.169605 hartree
dipole: 6.5751 -1.5909 0.9207
dipole: 6.8272
quadrupole: -111.0417 -157.4986 -153.9423
quadrupole: -4.5100 -9.1572 -2.0398
quadrupole: 29.7858 -16.6711 -13.1148 -4.5100 -9.1572 -2.0398
hfenergy: -1222.5163054 hartree
pointgroup: C01 [X(C19H24N2O5)]
dipole: 2.5769602 0.7477993 -0.1212925 debye
polarizability: 291.5773543|2.6520069|223.6193672|11.6350444|30.762057|184.169112 unknown
InChI: InChI=1S/C19H24N2O5/c1-13-11-21(17-10-15(23)16(12-22)26-17)19(25)20(18(13)24)9-5-8-14-6-3-2-4-7-14/h2-4,6-7,11,15-17,22-23H,5,8-10,12H2,1H3
charge 0 multiplicity 1
50 atoms
O  3.718539 1.0810 1.193961
O  5.020449 0.463252 -2.087181
O  7.189679 0.258243 0.284758
O  0.23638 1.1608 1.505373
O  -0.70903 -2.900967 -0.646317
N  1.761446 0.349086 -0.09509
N  -0.216242 -0.881262 0.44272
C  2.672139 1.477735 0.222859
C  4.855732 1.360327 -0.934263
C  3.455893 2.025127 -0.994154
C  4.856016 0.566081 0.40743
C  6.139716 0.730054 1.212575
C  0.566928 0.26534 0.675879
C  2.098549 -0.630592 -1.036929
C  -1.476933 -1.004429 1.222611
C  1.319259 -1.736555 -1.272644
C  0.079872 -1.917128 -0.507737
C  -2.668917 -0.328485 0.51149
C  -3.979265 -0.505158 1.326265
C  1.672867 -2.787649 -2.296593
C  -5.170874 0.148634 0.641903
C  -5.539858 1.485312 0.942014
C  -5.912929 -0.55103 -0.345217
C  -6.619016 2.108437 0.274831
C  -6.99262 0.067033 -1.015186
C  -7.349671 1.400749 -0.707658
H  2.054362 2.216827 0.750572
H  5.662186 2.117389 -0.937204
H  3.54353 3.117424 -0.8828
H  2.966589 1.821836 -1.959721
H  4.705886 -0.509167 0.176613
H  6.106423 0.115949 2.133287
H  6.291262 1.794025 1.486104
H  3.023701 -0.460104 -1.598394
H  5.91558 0.042447 -2.005733
H  -1.671154 -2.083665 1.342434
H  -1.304523 -0.538809 2.207385
H  -2.798789 -0.772679 -0.492886
H  -2.46018 0.74947 0.379226
H  -4.167352 -1.588417 1.463488
H  -3.834485 -0.069711 2.334581
H  8.064085 0.231917 0.743753
H  1.755826 -3.782364 -1.822308
H  2.625213 -2.551112 -2.801042
H  0.878149 -2.874627 -3.059628
H  -4.97824 2.038728 1.705284
H  -5.643554 -1.587332 -0.585981
H  -6.891604 3.140868 0.522613
H  -7.556724 -0.490264 -1.772043
H  -8.188594 1.880617 -1.224398
