program: Gaussian 09
title: 000266676
version: EM64L-G09RevD.01
frameworkgroup: C1[X(C13H17N3O8)]
method: RPBEPBE
basis: SDD
operation: Freq
keyword: #p
keyword: freq=noraman
keyword: PBEPBE/SDD
title: #p freq=noraman PBEPBE/SDD
converged: NO YES NO NO
title: Mulliken charges:
elementType: O O O O O O O O N N N C C C C C C C C C C C C C H H H H H H H H H H H H H H H H H
charge: -0.236261 -0.449623 -0.422782 -0.239086 -0.185269 -0.266719 -0.209686 -0.204717 -0.418396 0.023097 0.016690 -0.058034 -0.201665 -0.062770 -0.087978 0.001926 -0.709672 0.293558 0.230975 -0.278242 -0.506135 -0.504578 -0.406856 0.445621 0.264140 0.213582 0.193067 0.237350 0.168042 0.337908 0.219531 0.235766 0.241824 0.366383 0.364034 0.279640 0.196385 0.239434 0.246588 0.337684 0.295241
chargesum: 0.00000
title: Mulliken charges with hydrogens summed into heavy atoms:
elementType: O O O O O O O O N N N C C C C C C C C C C C C C
charge: -0.236261 -0.083239 -0.058748 -0.239086 -0.185269 -0.266719 -0.209686 -0.204717 -0.080488 0.023097 0.016690 0.206106 0.011917 0.130297 0.149372 0.169968 -0.012551 0.293558 0.230975 0.001399 0.176273 -0.166894 -0.111615 0.445621
polarizability: 3.34768800e+02 1.30288103e+01 2.17442782e+02 -6.75517319e+00 -1.58032815e+01 1.22430685e+02
1716.lowfreq: -12.5717 -4.5088 -0.0010 -0.0006 -0.0004 2.6004 20.3786 22.0150 31.6438
frequency: 19.3788 21.8845 31.5956 55.4108 71.6532 76.2905 90.5760 102.9518 109.9904 123.8002 137.8123 153.5065 161.9886 171.9373 187.1593 214.9155 236.7277 247.9529 270.6679 283.1756 286.4976 311.0466 322.6950 329.3388 364.9354 373.9660 393.9832 407.5258 420.2440 435.6600 453.0541 466.9215 500.4975 512.5067 524.2912 559.8316 601.7179 636.9748 650.3263 655.8123 686.0064 704.9272 723.9033 737.2943 755.2316 804.4922 814.2095 824.8994 835.8163 876.3192 886.2836 897.3346 913.5689 938.7730 966.0428 975.3240 992.6425 1016.6083 1039.6161 1047.4566 1071.5708 1076.3716 1090.3501 1106.5032 1113.4564 1118.3524 1128.4972 1143.7127 1150.4210 1166.2208 1167.8371 1175.6793 1213.9372 1215.9967 1237.0697 1249.0559 1269.5118 1284.3692 1296.3014 1312.9616 1332.6565 1338.8129 1343.4380 1358.2449 1362.6224 1364.1057 1373.4396 1382.4891 1395.7140 1401.8100 1434.3526 1451.1237 1453.3805 1462.6097 1476.2274 1478.2914 1489.9540 1524.7644 1585.1808 1625.9165 2820.0453 2883.4022 2953.9419 2962.9562 2990.4899 3000.0102 3059.5706 3068.9154 3100.5280 3105.9282 3130.4066 3175.2267 3186.7555 3193.1795 3249.9566 3540.2190 3588.4526
redmass: 5.2638 5.8818 6.3704 12.6304 7.6148 4.8085 3.0640 3.9021 4.9472 2.2311 2.6189 4.6438 5.4241 7.9585 2.1157 1.4267 4.0590 7.1038 3.1597 1.4366 2.8874 7.3439 5.2806 4.5130 5.5181 5.9140 3.3227 1.8771 3.4434 3.7263 5.6163 3.8388 7.3615 3.9301 3.6981 4.4437 4.8583 7.2566 6.9301 5.5900 5.3807 7.4946 4.6922 5.2096 11.1141 5.7146 2.3558 1.8582 1.2898 3.0457 5.2611 2.4855 5.0373 2.5560 1.4116 4.8257 1.3399 3.1492 3.7059 2.4788 2.9566 2.5030 2.8786 4.8166 1.3590 2.2795 2.1920 1.7089 1.4425 2.9284 4.3071 1.3236 4.6827 1.2940 1.3568 1.6570 1.2243 1.2086 1.3025 2.1237 1.4613 1.3639 3.5628 1.5275 4.0928 1.3231 1.3228 4.6595 1.2366 1.6103 1.2127 5.3368 1.0516 1.0477 1.0544 1.0487 2.9991 3.3154 3.7434 7.1778 1.0803 1.0822 1.0396 1.0826 1.0854 1.0360 1.0847 1.0929 1.1001 1.0999 1.1030 1.0884 1.0918 1.0967 1.0787 1.0652 1.0665
irintensity: 3.2545 0.2218 3.0534 0.1489 4.9472 1.7025 0.5141 3.1348 5.8817 2.3934 2.4983 1.9025 0.9510 3.2563 2.1687 1.6433 11.2851 1.3470 18.5834 150.3872 124.0777 1.3613 3.7538 5.6620 14.5731 1.4399 38.2114 86.9039 13.3662 4.4930 71.7752 0.3556 4.0847 7.6235 1.1615 23.8040 6.1484 10.4598 9.5520 7.8310 36.1587 9.4252 2.1778 30.7712 13.4888 13.4493 33.0618 111.4671 32.3472 1.2656 3.8974 30.6637 20.5350 128.9495 25.9051 77.3380 3.8800 102.9035 81.4838 11.8246 18.4094 44.4099 22.0414 52.6406 8.0972 94.0687 39.5524 25.1970 51.6712 147.1585 296.0964 64.2261 369.3725 51.9483 17.1424 64.8954 11.8417 9.9030 61.1056 72.5659 23.0420 18.1982 173.5196 12.9630 59.8128 10.7425 13.3197 27.2019 18.0210 8.4592 15.9180 4.1327 11.3347 10.7595 14.3296 15.2728 65.9058 76.5884 133.6663 365.8064 68.1186 47.0767 73.6727 31.1900 65.5578 11.3908 4.6583 38.1204 21.2618 25.3797 23.6602 1.3041 18.5580 4.2423 90.6222 14.6972 7.6726
temp: 298.150 k
press: 1.00000 atm
elementType: 8 8 8 8 8 8 8 8 7 7 7 6 6 6 6 6 6 6 6 6 6 6 6 6 1 1 1 1 1 1 1 1 1 1 1 1 1 1 1 1 1
symmnumber: 1
zpe: 805369.4 jmol-1
zpe.correction: 0.306749 hartree
zpe.thermalcorrener: 0.330286 hartree
zpe.thermalcorrenthalpy: 0.331230 hartree
zpe.thermalcorrgfe: 0.252095 hartree
zpe.sumelectzpe: -1269.612052 hartree
zpe.sumelectthermal: -1269.588515 hartree
zpe.sumelectthermalent: -1269.587571 hartree
zpe.sumelectthermalfe: -1269.666706 hartree
dipole: 6.5471 1.4866 -1.7039
dipole: 6.9266
quadrupole: -176.6893 -158.3559 -136.3159
quadrupole: 12.7051 -1.8061 6.4074
quadrupole: -19.5689 -1.2356 20.8045 12.7051 -1.8061 6.4074
hfenergy: -1269.9188012 hartree
pointgroup: C01 [X(C13H17N3O8)]
dipole: -2.5653078 0.5868188 0.707954 debye
polarizability: 334.5626437|-9.8330391|219.1636264|-15.560888|1.9801085|120.9159974 unknown
InChI: InChI=1S/C13H17N3O8/c1-6-10(11(17)12(18)13(23-2)24-6)14-8-4-3-7(15(19)20)5-9(8)16(21)22/h3-6,10-14,17-18H,1-2H3
charge 0 multiplicity 1
41 atoms
O  -3.759646 0.084288 -0.965732
O  -1.149238 -1.171843 2.10007
O  -3.118925 -2.348684 0.606152
O  -5.547744 -0.954468 0.182658
O  3.194321 3.318173 -0.062359
O  0.937248 3.14736 0.172698
O  5.148403 -2.595222 -0.731583
O  6.034875 -0.490454 -0.624726
N  -0.215942 0.805684 0.044427
N  2.12483 2.605082 -0.003545
N  5.036639 -1.311212 -0.608267
C  -1.480155 0.064719 -0.052812
C  -2.043782 -0.276156 1.355788
C  -2.536382 0.8930 -0.852722
C  -3.372628 -1.054655 1.226146
C  -4.343643 -0.231658 0.361197
C  -2.101833 1.227036 -2.280129
C  1.047459 0.293533 -0.105805
C  2.220383 1.151959 -0.135398
C  1.283726 -1.120465 -0.245112
C  -6.594603 -0.196948 -0.525491
C  3.51933 0.623313 -0.298758
C  2.564511 -1.637767 -0.410293
C  3.683154 -0.758247 -0.437905
H  -1.341441 -0.882753 -0.601617
H  -2.209317 0.667981 1.920312
H  -2.761062 1.830114 -0.28454
H  -3.817425 -1.177712 2.235408
H  -4.529096 0.750287 0.87627
H  -0.233252 1.83875 0.148362
H  -1.19822 1.860533 -2.289077
H  -1.894995 0.3001 -2.842641
H  -2.911644 1.768752 -2.796685
H  -0.320586 -0.69534 2.3543
H  -2.469042 -2.817247 1.192892
H  0.435133 -1.805539 -0.199022
H  -6.809515 0.760939 -0.006787
H  -7.485021 -0.842024 -0.501951
H  -6.292413 0.002602 -1.567532
H  4.381626 1.294701 -0.318837
H  2.734111 -2.712911 -0.512557
