program: Gaussian 09
title: 000266675
version: EM64L-G09RevD.01
frameworkgroup: C1[X(C14H19N3O6)]
method: RPBEPBE
basis: SDD
operation: Freq
keyword: #p
keyword: freq=noraman
keyword: PBEPBE/SDD
title: #p freq=noraman PBEPBE/SDD
converged: YES YES NO NO
title: Mulliken charges:
elementType: O O O O O O N N N C C C C C C C C C C C C C C H H H H H H H H H H H H H H H H H H H
charge: -0.259245 -0.260015 -0.189500 -0.265045 -0.213988 -0.207098 -0.389027 0.023207 0.015707 -0.088833 -0.477546 0.011388 -0.422974 0.045709 -0.726636 0.325555 -0.216872 0.240095 -0.270037 -0.509147 -0.420143 -0.678396 0.446531 0.229570 0.203517 0.246621 0.185307 0.231358 0.227700 0.167239 0.339760 0.227393 0.219560 0.243325 0.184709 0.229369 0.253933 0.337070 0.293086 0.207652 0.233097 0.226045
chargesum: 0.00000
title: Mulliken charges with hydrogens summed into heavy atoms:
elementType: O O O O O O N N N C C C C C C C C C C C C C C
charge: -0.259245 -0.260015 -0.189500 -0.265045 -0.213988 -0.207098 -0.049266 0.023207 0.015707 0.140737 -0.027407 0.196694 0.036085 0.212948 -0.036359 0.325555 0.197205 0.240095 -0.016104 -0.172077 -0.127057 -0.011602 0.446531
polarizability: 3.44919965e+02 1.72101088e+01 2.21131319e+02 -7.28521106e+00 9.67381999e+00 1.24405544e+02
1716.lowfreq: -3.2880 -0.0011 -0.0005 0.0007 2.6382 7.7806 25.2272 25.8310 30.8396
frequency: 25.1617 25.8115 30.7806 53.8821 57.8682 74.7621 81.8691 88.8771 118.4493 138.7623 150.2911 162.9990 168.4222 182.0371 203.9977 230.3208 256.3030 259.9423 286.7216 307.6627 313.6415 341.3663 359.7012 377.3295 390.9777 411.0927 436.5572 468.2833 481.1733 495.2227 510.1394 515.6606 527.0431 589.0542 620.0403 638.6916 650.9565 677.3903 705.0624 725.3804 753.7133 790.6773 799.5082 811.9155 819.0204 819.7673 830.8223 848.7217 885.5817 890.7024 900.6105 936.6960 968.0828 992.2275 1004.7398 1024.1294 1044.2788 1050.1789 1060.4915 1083.7750 1089.3300 1105.7722 1107.8921 1114.7909 1137.1456 1142.9675 1148.0470 1157.3381 1167.8660 1196.2171 1214.7081 1219.2664 1244.9299 1249.5013 1274.5916 1288.1326 1294.9644 1308.8861 1315.3121 1332.0520 1338.3771 1343.6089 1350.3885 1358.5113 1363.2195 1382.6862 1388.1036 1391.3639 1404.0169 1453.2246 1455.5656 1461.0406 1461.4366 1469.6732 1475.9554 1480.0367 1492.6959 1492.8575 1528.6853 1584.9643 1627.8485 2857.0688 2908.6763 2949.1224 2970.3460 2995.3802 2996.4562 3014.4282 3035.4490 3040.9942 3058.3417 3081.2845 3093.1293 3095.9242 3102.7834 3103.7016 3174.0475 3187.0776 3192.4451 3260.4394
redmass: 4.9099 4.4044 4.5477 2.4935 10.7167 10.5703 4.8813 2.8791 4.9976 3.4222 6.4778 5.3761 4.6572 4.3559 1.1440 1.4275 2.5893 2.2847 3.9155 5.2701 4.6789 6.1162 4.2867 7.5636 4.3147 4.1826 3.7966 4.2419 4.3252 5.4891 3.8251 4.0025 2.6769 4.6229 3.8307 7.0876 6.9228 8.5046 7.7293 4.3798 12.2818 2.5655 3.8088 1.1556 1.6188 2.2756 1.2058 2.9683 4.1449 2.9442 1.8077 2.7737 1.4069 1.3294 1.4849 2.7029 2.8329 2.3398 2.8604 2.9000 3.0896 3.7484 2.2035 3.2545 1.4986 1.8876 1.7163 2.2863 8.6432 1.5229 3.8120 1.4942 1.7264 1.1586 1.2565 1.3046 1.3659 1.2154 1.9386 1.5850 1.3069 3.1284 1.3601 1.9554 2.5882 4.2708 1.2762 1.2739 1.4603 4.9526 1.0895 1.0405 1.0687 1.0933 1.0517 1.0498 2.5011 1.1460 3.5577 3.6359 7.3078 1.0828 1.0830 1.0643 1.0658 1.0360 1.0361 1.0610 1.0845 1.0981 1.0960 1.1034 1.0989 1.0997 1.0995 1.1014 1.0879 1.0918 1.0966 1.0785
irintensity: 1.2380 0.0268 1.6902 0.3393 0.0668 1.3123 1.8674 4.5231 1.2276 4.9438 2.1148 1.7768 1.2586 1.8303 0.1180 0.5912 3.1868 2.1794 1.3118 0.6551 1.2613 0.3266 4.1523 0.2335 3.4391 0.0662 1.1227 1.8572 1.4116 24.2499 8.2986 8.8369 7.2434 2.8346 8.9905 14.4450 15.8002 13.1195 9.0296 1.1459 13.6929 30.4404 21.4507 3.9134 98.4036 1.0306 21.3486 16.6572 11.1187 12.6105 18.7400 265.1770 24.7397 0.1781 11.7654 13.6776 65.1326 65.2209 156.5349 29.9237 25.2351 54.2491 7.2024 80.5650 7.1232 21.1024 115.8023 8.4737 419.3262 34.8405 290.1532 79.8494 77.1045 3.8831 0.4530 7.4819 73.5791 7.4727 50.9457 56.8993 2.5258 160.3406 18.4882 43.4825 22.9624 28.9363 26.6128 32.8721 3.2914 3.9157 10.1923 11.1836 12.7944 16.9363 8.1993 7.1068 45.1344 15.6910 91.8451 143.2666 395.1708 61.8469 41.5097 58.6205 21.9372 28.1813 11.5958 19.9582 12.5880 18.4377 27.6260 25.3843 31.6353 25.6633 30.2804 38.7932 2.3620 16.8174 9.0194 90.4522
temp: 298.150 k
press: 1.00000 atm
elementType: 8 8 8 8 8 8 7 7 7 6 6 6 6 6 6 6 6 6 6 6 6 6 6 1 1 1 1 1 1 1 1 1 1 1 1 1 1 1 1 1 1 1
symmnumber: 1
zpe: 861229.9 jmol-1
zpe.correction: 0.328025 hartree
zpe.thermalcorrener: 0.350351 hartree
zpe.thermalcorrenthalpy: 0.351296 hartree
zpe.thermalcorrgfe: 0.274486 hartree
zpe.sumelectzpe: -1158.577995 hartree
zpe.sumelectthermal: -1158.555669 hartree
zpe.sumelectthermalent: -1158.554725 hartree
zpe.sumelectthermalfe: -1158.631535 hartree
dipole: 8.3414 -0.1757 -0.0354
dipole: 8.3433
quadrupole: -173.5260 -152.7143 -131.8086
quadrupole: 1.6252 6.9099 -3.5860
quadrupole: -20.8430 -0.0313 20.8743 1.6252 6.9099 -3.5860
hfenergy: -1158.9060205 hartree
pointgroup: C01 [X(C14H19N3O6)]
dipole: -3.2713684 0.1971404 -0.1847281 debye
polarizability: 341.812849|-2.5623168|184.169673|31.4604539|47.076167|164.4743062 unknown
InChI: InChI=1S/C14H19N3O6/c1-3-22-14-7-6-11(9(2)23-14)15-12-5-4-10(16(18)19)8-13(12)17(20)21/h4-5,8-9,11,14-15H,3,6-7H2,1-2H3
charge 0 multiplicity 1
42 atoms
O  -3.49003 0.211951 0.63026
O  -5.484582 0.809992 -0.484117
O  3.489778 -2.766142 -1.456656
O  1.244562 -2.546334 -1.754702
O  5.082842 2.101234 2.143894
O  6.078379 0.308111 1.133043
N  -0.02362 -0.527129 -0.675145
N  2.387872 -2.133421 -1.249386
N  5.044496 1.03123 1.414548
C  -1.315184 0.16185 -0.52501
C  -2.055006 0.14817 -1.889562
C  -2.211265 -0.516147 0.566878
C  -3.459698 0.781353 -1.776238
C  -4.254025 0.117023 -0.649289
C  -1.628574 -0.488907 1.979903
C  1.188322 -0.157192 -0.161515
C  -6.411786 0.185867 0.494115
C  2.397566 -0.921447 -0.430467
C  1.346552 1.010893 0.667916
C  3.651209 -0.529952 0.086053
C  2.583451 1.397351 1.1714
C  -7.707111 0.992704 0.459659
C  3.738814 0.620574 0.876216
H  -1.157832 1.212111 -0.2198
H  -2.14548 -0.903229 -2.236219
H  -1.451966 0.684451 -2.643742
H  -2.395751 -1.569456 0.245497
H  -3.389378 1.859855 -1.545008
H  -4.009363 0.674285 -2.728311
H  -4.417608 -0.974185 -0.847654
H  0.01627 -1.389574 -1.251006
H  -0.651463 -0.999848 2.020022
H  -1.50585 0.551863 2.328475
H  -2.316036 -0.998461 2.675826
H  -6.583696 -0.872852 0.200536
H  -5.941368 0.204208 1.494365
H  0.466819 1.608147 0.91464
H  4.540045 -1.12623 -0.135549
H  2.690361 2.286758 1.797939
H  -8.437979 0.573357 1.174838
H  -7.512869 2.043487 0.734792
H  -8.153317 0.975478 -0.549538
