program: Gaussian 09
title: 000266668
version: EM64L-G09RevD.01
frameworkgroup: C1[X(C20H23N3O13)]
method: RPBEPBE
basis: SDD
operation: Freq
keyword: #p
keyword: freq=noraman
keyword: PBEPBE/SDD
title: #p freq=noraman PBEPBE/SDD
converged: YES YES NO NO
title: Mulliken charges:
elementType: O O O O O O O O O O O O O N N N C C C C C C C C C C C C C C C C C C C C H H H H H H H H H H H H H H H H H H H H H H H
charge: -0.234338 -0.268986 -0.275916 -0.254175 -0.282816 -0.246314 -0.232564 -0.218613 -0.238736 -0.274415 -0.189565 -0.210976 -0.207264 -0.388365 0.027546 0.016218 -0.137002 -0.188870 -0.066607 -0.085988 -0.085258 -0.367115 0.330330 0.316686 0.301887 0.236458 -0.290522 0.310460 -0.760335 -0.760523 -0.507122 0.311005 -0.429735 0.448294 -0.755273 -0.770025 0.355482 0.310526 0.311171 0.256537 0.261483 0.392104 0.241013 0.273492 0.310263 0.256945 0.255439 0.256264 0.335802 0.255861 0.251087 0.253309 0.295723 0.253944 0.250089 0.268241 0.242434 0.244243 0.297085
chargesum: 0.00000
title: Mulliken charges with hydrogens summed into heavy atoms:
elementType: O O O O O O O O O O O O O N N N C C C C C C C C C C C C C C C C C C C C
charge: -0.234338 -0.268986 -0.275916 -0.254175 -0.282816 -0.246314 -0.232564 -0.218613 -0.238736 -0.274415 -0.189565 -0.210976 -0.207264 0.003739 0.027546 0.016218 0.218480 0.121657 0.244563 0.170548 0.176224 0.147390 0.330330 0.316686 0.301887 0.236458 0.019741 0.310460 0.008313 -0.000266 -0.171320 0.311005 -0.134011 0.448294 0.017001 0.013736
polarizability: 3.87062740e+02 -2.89571127e+00 3.14290344e+02 2.25944775e+01 1.86070093e+01 2.30072893e+02
1716.lowfreq: -42.5136 -22.2884 -4.5192 -0.0006 0.0006 0.0007 2.8217 6.8258 16.7844
frequency: -42.4765 -22.2280 16.7492 21.7613 24.5376 31.1781 35.8969 39.4694 41.1150 47.4937 55.9276 57.7283 64.5982 65.9565 74.6222 78.9410 86.6292 94.7957 101.7943 106.1981 114.8510 132.8922 150.4376 164.3087 172.9422 177.4422 181.5320 187.2284 195.7401 209.2623 223.3016 241.9253 255.6432 261.7707 311.7094 315.1718 319.2932 331.1268 357.7466 365.0976 387.8452 392.8730 406.2730 428.9090 443.4345 468.1703 483.3461 502.0733 509.3318 521.3150 548.0566 554.3920 562.3130 565.4653 583.0645 587.9018 600.1064 606.7197 607.0781 614.6907 632.4316 655.8889 659.8224 671.2215 674.1411 706.8071 733.4472 740.9653 754.1442 771.4242 796.5911 816.6742 828.1860 840.6566 848.9043 861.9731 874.1662 887.7408 908.4926 911.2892 934.4240 962.7164 966.2882 977.3403 987.9110 993.7975 996.8174 1003.3595 1007.8839 1014.0519 1029.1835 1042.1916 1043.9185 1044.4462 1049.5065 1053.2013 1058.7257 1071.0636 1094.5866 1106.8141 1135.3983 1154.9772 1158.5746 1170.9699 1175.2860 1182.3159 1186.7580 1200.8602 1205.5534 1218.0492 1242.0784 1257.4833 1264.4511 1291.3191 1297.6220 1308.3943 1316.7577 1336.5315 1343.9109 1348.9004 1351.4518 1355.6680 1365.6869 1366.9442 1376.4127 1387.3743 1388.2811 1388.9898 1396.8037 1397.1151 1451.2850 1451.7930 1452.0174 1452.3199 1453.3826 1453.8485 1454.4816 1455.2355 1457.8068 1464.6744 1479.3813 1527.0529 1579.1233 1627.2915 1643.6584 1657.7086 1672.1978 1684.8903 2987.4270 2994.3092 3004.7854 3006.8085 3007.1773 3009.2314 3034.2128 3038.0018 3046.7292 3063.8748 3090.7467 3099.0168 3099.1805 3099.9067 3107.5912 3139.9879 3143.0482 3144.7254 3146.7686 3148.2526 3185.2094 3188.8215 3301.0433
redmass: 1.0169 1.0221 8.1589 6.7729 7.6011 7.7869 7.5906 8.0144 7.1627 5.6093 11.9990 5.0745 3.9167 4.5586 5.8137 7.8798 6.2312 4.8330 1.1088 4.6757 7.8318 5.9977 8.2589 1.1725 3.6636 6.8749 8.2970 8.0051 6.5861 7.4012 6.2728 7.2017 5.0229 6.5413 3.1989 4.9911 6.8567 6.7881 8.1618 4.0610 4.6075 6.3511 3.4631 4.2036 4.0758 4.1769 6.2658 4.9048 6.9965 3.7356 3.5723 3.3736 3.4576 3.3763 4.2198 4.5188 6.6071 4.4981 5.0261 5.6637 6.6181 7.3348 5.7268 4.7079 8.6365 7.5366 4.4935 5.1514 11.9552 4.1732 1.5339 3.4766 4.1759 3.3653 5.7256 1.6353 5.3428 5.1419 5.5877 4.1371 4.1548 3.7208 1.4165 2.7166 2.1115 1.9568 2.0867 2.9641 1.3788 4.5418 3.5982 1.6648 1.6798 1.6836 2.5197 1.6500 2.3540 2.8161 2.7141 3.9860 2.7108 2.4216 1.9882 4.1143 3.1165 3.7964 3.0430 3.5612 1.4546 5.9904 1.1673 1.6810 1.3362 1.3362 1.5439 1.4637 1.4651 1.5488 3.0632 1.4734 1.3020 1.5199 4.5681 1.5434 1.7140 1.2546 1.2547 1.2520 1.4356 1.8986 1.0591 1.0549 1.0509 1.0582 1.0575 1.0807 1.0642 3.7280 1.0611 1.0616 2.5196 3.8670 5.1250 6.9013 9.4534 9.9898 9.4224 10.1957 1.0831 1.0409 1.0839 1.0388 1.0392 1.0379 1.0585 1.0852 1.0837 1.0866 1.0920 1.0956 1.0939 1.0936 1.1069 1.1017 1.1023 1.1023 1.1018 1.0917 1.0949 1.0922 1.0786
irintensity: 0.4669 0.4694 0.4095 0.5896 0.1405 0.2847 1.0130 0.4476 0.8040 1.0631 0.0299 0.2543 4.5084 2.7449 0.1122 0.8033 6.6232 0.3379 0.1372 5.8854 2.0799 3.2171 2.6118 0.2135 2.1682 1.9259 7.6452 2.3416 7.2331 4.6620 2.0256 2.8305 2.8308 5.1748 7.2971 4.4812 20.7760 5.8732 2.0913 22.6925 6.2636 6.9007 1.3763 4.7719 1.1804 2.7902 13.4628 18.3121 3.0190 6.8672 4.9391 1.5694 0.8106 14.0794 13.6079 19.7000 13.8436 2.4982 2.5269 19.6231 0.0760 9.3994 10.2219 12.7632 9.3616 9.5031 1.6765 16.3732 10.2986 22.9178 115.6127 8.7444 8.9639 34.1036 40.5668 21.8322 62.8423 20.4292 63.1580 46.4295 189.1359 84.3089 28.1435 37.7665 6.5428 9.3960 136.0617 215.3540 15.8654 35.1776 166.8305 17.5467 7.4146 20.2606 6.1140 16.2393 61.8816 22.4302 55.3738 42.4249 86.9170 82.3728 118.5202 141.4942 155.4692 749.2928 321.2853 200.6653 53.5754 313.6455 5.4666 43.9409 3.1436 10.4371 82.9119 13.4313 30.8307 37.2383 146.4733 1.9934 8.1703 14.3239 47.4824 9.0610 22.5973 61.6020 67.3007 44.7981 81.4669 8.1463 7.4028 23.3390 18.2809 50.0064 12.5698 24.9175 27.4139 10.9940 12.2510 26.7601 12.5202 138.5829 135.4265 289.0542 218.6310 201.3439 190.9476 180.5056 18.2487 17.8797 10.1601 0.8433 0.3285 0.1748 25.4663 14.1211 6.8867 2.4658 7.4783 3.9160 5.1783 5.9118 6.3077 8.5262 5.4841 4.2102 9.0678 10.9710 4.6325 17.9588 112.3471
temp: 298.150 k
press: 1.00000 atm
elementType: 8 8 8 8 8 8 8 8 8 8 8 8 8 7 7 7 6 6 6 6 6 6 6 6 6 6 6 6 6 6 6 6 6 6 6 6 1 1 1 1 1 1 1 1 1 1 1 1 1 1 1 1 1 1 1 1 1 1 1
symmnumber: 1
zpe: 1131531.5 jmol-1
zpe.correction: 0.430978 hartree
zpe.thermalcorrener: 0.466198 hartree
zpe.thermalcorrenthalpy: 0.467143 hartree
zpe.thermalcorrgfe: 0.358874 hartree
zpe.sumelectzpe: -1915.266267 hartree
zpe.sumelectthermal: -1915.231046 hartree
zpe.sumelectthermalent: -1915.230102 hartree
zpe.sumelectthermalfe: -1915.338371 hartree
dipole: 7.4344 5.8091 1.6187
dipole: 9.5727
quadrupole: -267.9029 -205.3530 -188.8812
quadrupole: 21.3449 -14.7877 -8.4383
quadrupole: -47.1905 15.3594 31.8312 21.3449 -14.7877 -8.4383
hfenergy: -1915.6972448 hartree
pointgroup: C01 [X(C20H23N3O13)]
dipole: -2.3136835 -2.3214983 -1.8551568 debye
polarizability: 385.4705473|17.8757651|289.6117758|5.0869204|46.8738836|256.343654 unknown
InChI: InChI=1S/C20H23N3O13/c1-9(24)32-8-16-18(33-10(2)25)19(34-11(3)26)17(20(36-16)35-12(4)27)21-14-6-5-13(22(28)29)7-15(14)23(30)31/h5-7,16-21H,8H2,1-4H3
charge 0 multiplicity 1
59 atoms
O  -2.541292 -0.287369 0.556298
O  -1.026395 -2.447589 -1.820588
O  -1.755537 -0.014377 -3.07563
O  -1.652574 -1.540717 2.301549
O  -2.925313 2.269982 -0.725447
O  1.1027 -3.380116 -1.654413
O  0.318952 0.982354 -3.453669
O  -3.592178 -2.858139 2.343059
O  -4.446347 2.775879 0.980572
O  0.149428 2.184725 2.029897
O  2.036784 3.324666 2.591724
O  6.708992 -0.2907 0.507877
O  6.426092 1.689847 1.613094
N  0.327536 -0.142486 0.847023
N  1.459343 2.300029 2.068353
N  5.96611 0.627432 1.038151
C  -0.471049 -1.176313 -1.276094
C  -0.325851 -1.319293 0.275705
C  -1.450073 -0.041517 -1.625975
C  -2.807357 -0.168527 -0.897889
C  -1.739855 -1.476537 0.858148
C  -3.700576 1.057295 -1.074844
C  1.68095 0.056602 0.877225
C  -0.098756 -3.492772 -1.989215
C  -0.776107 0.58007 -3.900205
C  2.271952 1.232833 1.48846
C  2.591832 -0.897015 0.296497
C  -2.726683 -2.217672 2.964803
C  -0.762477 -4.710868 -2.580364
C  -1.263585 0.659882 -5.326222
C  3.67081 1.41389 1.540089
C  -3.377396 3.024214 0.388466
C  3.970129 -0.714568 0.349971
C  4.506572 0.442167 0.980972
C  -2.608723 -2.013779 4.451429
C  -2.380082 4.106738 0.716644
H  0.514926 -0.99477 -1.735653
H  0.258384 -2.231088 0.492766
H  -0.96976 0.912684 -1.342644
H  -3.345099 -1.069416 -1.26135
H  -2.239479 -2.379625 0.453344
H  -0.251558 0.594386 1.2888
H  -4.000508 1.158487 -2.130254
H  -4.586454 0.98746 -0.419715
H  2.200057 -1.782364 -0.213889
H  -1.517494 -4.422794 -3.328315
H  -1.279724 -5.275447 -1.782666
H  -0.001225 -5.364505 -3.030686
H  4.086942 2.308367 2.010319
H  -1.904852 1.552719 -5.444202
H  -1.867884 -0.223401 -5.585982
H  -0.405603 0.756818 -6.007562
H  4.654374 -1.443219 -0.092504
H  -1.565821 -2.148739 4.781698
H  -3.274761 -2.710053 4.980524
H  -2.898978 -0.976302 4.697465
H  -1.947466 4.535383 -0.201448
H  -2.867134 4.890579 1.315195
H  -1.551958 3.672386 1.308611
