program: Gaussian 09
title: 000266649
version: EM64L-G09RevD.01
frameworkgroup: C1[X(C25H22N2O4)]
method: RPBEPBE
basis: SDD
operation: Freq
keyword: #p
keyword: freq=noraman
keyword: PBEPBE/SDD
title: #p freq=noraman PBEPBE/SDD
converged: YES YES NO NO
title: Mulliken charges:
elementType: O O O O N N C C C C C C C C C C C C C C C C C C C C C C C C C H H H H H H H H H H H H H H H H H H H H H H
charge: -0.444312 -0.413799 -0.219234 -0.221794 -0.156127 0.016119 -0.531237 -0.457004 0.230155 -0.522994 0.189574 0.355286 0.481576 0.435954 0.110559 -0.371349 -0.461812 -0.423714 0.067937 -0.424608 -0.449473 -0.376041 -0.440644 -0.260996 0.381091 -0.252061 -0.343459 -0.379698 -0.244260 -0.228631 -0.238816 0.242310 0.251334 0.263180 0.236990 0.232179 0.199942 0.287145 0.238650 0.215062 0.313492 0.238439 0.256028 0.233422 0.234973 0.228598 0.227058 0.285653 0.233713 0.224489 0.357374 0.228169 0.365615
chargesum: 0.00000
title: Mulliken charges with hydrogens summed into heavy atoms:
elementType: O O O O N N C C C C C C C C C C C C C C C C C C C C C C C C C
charge: -0.086938 -0.048184 -0.219234 -0.221794 -0.156127 0.016119 -0.037594 0.043165 0.230155 -0.090873 0.189574 0.355286 0.481576 0.435954 0.110559 -0.084205 -0.223162 -0.208652 0.067937 -0.111116 -0.211034 -0.120014 -0.207221 -0.026023 0.381091 -0.023463 -0.116400 -0.094046 -0.010546 -0.004142 -0.010647
polarizability: 2.72432545e+02 -5.72625165e+00 2.90438576e+02 -3.62262780e+01 3.09645191e+01 3.47969579e+02
1716.lowfreq: -5.7779 0.0004 0.0006 0.0008 4.6940 5.4594 14.8317 19.2960 22.7281
frequency: 14.6586 19.1637 22.6806 26.3907 35.3973 48.0279 61.0193 71.0990 80.9965 96.0951 105.8890 110.5632 143.7770 173.3278 192.1649 206.9852 212.5825 250.1242 281.2699 305.4413 313.6088 319.8808 322.8132 330.3374 348.0088 350.1551 368.4996 390.5268 404.8033 405.5935 421.6050 428.3266 447.4832 475.7303 484.4697 504.7185 517.8470 527.1261 530.2928 544.2401 553.1856 578.7811 602.8745 615.8416 616.2245 624.7325 661.2956 683.8886 702.2278 707.5937 723.9428 732.3616 746.7183 752.7847 757.3114 782.4448 788.6862 808.0676 812.1101 817.4791 840.7845 859.1629 861.7840 879.5644 895.7669 917.4721 923.5667 939.7311 946.5842 961.7927 965.9175 968.8463 981.1595 987.5987 993.6778 995.2695 1000.2133 1011.8436 1025.1867 1034.8672 1056.6169 1061.1204 1083.5857 1098.3851 1105.5039 1123.0524 1147.4654 1152.8988 1163.0440 1171.6257 1175.4946 1185.9709 1188.9435 1203.5479 1213.5044 1215.8488 1230.5777 1233.8440 1240.9280 1242.6569 1252.7040 1260.9509 1277.2407 1283.3875 1324.5631 1352.9893 1356.1221 1362.9097 1368.1005 1376.7920 1387.3711 1408.3261 1422.0973 1426.5949 1427.1586 1437.5880 1439.2759 1460.2748 1469.2673 1470.8036 1483.6760 1486.7367 1487.7780 1516.8957 1591.0015 1592.9605 1601.2290 1609.8654 1611.8058 1612.5564 1636.7834 2865.1304 2917.0108 2936.2637 3014.9423 3016.3835 3021.2850 3108.1959 3114.2200 3119.1632 3123.8186 3123.9428 3134.5653 3137.1530 3141.5132 3145.9154 3156.4791 3162.6751 3172.8309 3187.1262 3189.8888 3574.1464 3586.8172
redmass: 7.9425 6.2384 5.4754 6.5806 5.1620 4.1694 10.8563 6.3546 5.0432 4.7117 5.7638 7.0725 4.5237 5.1301 4.6298 5.6855 4.7073 3.7893 3.2916 4.8115 4.8810 1.6238 2.0800 2.3431 7.1309 3.0589 3.9100 3.4458 1.6647 1.6159 3.2875 6.9884 3.1545 5.0027 3.9476 3.5827 5.0053 4.1395 3.4554 4.6364 4.0727 5.2950 4.8402 4.9638 6.3231 6.8343 3.9511 4.8228 5.6383 1.9524 4.7819 4.2761 4.4285 2.5554 1.3216 3.4360 4.5005 1.5271 1.5418 3.2213 4.1938 1.2834 4.2328 1.6158 3.4245 4.5636 1.4325 1.3414 1.7593 1.3633 1.8374 1.4072 1.4046 3.0244 2.0809 1.3520 1.3938 2.2077 2.1725 2.1597 2.3791 2.6082 1.6789 1.9682 2.5662 2.1545 1.4668 1.1945 1.1871 1.0545 1.1413 1.1745 2.2515 1.5255 3.5167 2.5723 1.6118 1.2973 2.0850 3.2850 2.2415 1.4086 1.5038 1.6258 1.2869 2.7534 2.4085 1.5077 2.4408 1.8930 3.3233 3.0930 6.1347 3.7255 3.3984 3.0734 2.2250 1.1521 1.3716 1.9406 2.0929 1.1406 2.6556 3.7933 7.4988 6.0229 7.0621 5.7895 7.4344 6.1561 6.7173 1.0709 1.0695 1.0662 1.0886 1.0914 1.0881 1.0874 1.0869 1.0873 1.0905 1.0862 1.0913 1.0899 1.0963 1.0960 1.0955 1.1015 1.0973 1.0942 1.0911 1.0660 1.0661
irintensity: 0.9115 1.0623 0.2767 0.8743 0.3278 0.1375 0.0062 0.2997 0.1578 1.8860 0.8792 1.3475 0.5228 1.1629 3.9754 5.8104 3.9019 7.1150 5.2071 1.1454 6.6410 64.0018 35.7605 23.3945 0.2929 1.6052 1.3770 2.2596 67.1882 62.5310 7.8767 2.2836 0.7343 7.7653 8.1502 4.2209 1.1177 5.8152 0.8664 7.9592 2.6687 14.9755 3.5485 2.7931 0.6051 11.2918 6.7241 16.2841 16.0471 36.7702 4.9015 17.2432 23.0516 49.4503 26.2058 16.5876 10.9066 77.1472 37.4780 19.2892 11.0016 0.5701 1.4512 1.5243 14.4839 33.2379 6.6400 1.3453 7.4029 2.8339 13.9863 7.2840 3.2575 19.2099 28.5533 2.1325 5.8892 36.4334 5.0777 10.7189 12.6442 69.4639 31.6612 101.6317 27.4372 53.5871 44.9576 18.6255 20.9097 0.2650 1.9002 3.6085 17.9512 0.4476 280.9591 115.9744 17.4206 22.8746 49.2054 162.9056 35.0623 17.6888 1.7519 7.9725 2.4416 85.1415 54.2690 11.5755 8.0440 6.5668 2.7113 7.6123 25.2311 9.7570 17.6237 1.2201 12.9024 10.9030 8.8610 7.0340 13.8410 5.5055 27.4252 36.6784 7.9724 1.0479 77.7617 3.9056 29.9242 2.5561 28.2937 93.0692 36.2137 45.6244 7.9875 20.0326 7.1236 12.7155 5.8324 3.4956 15.7423 1.1141 13.4909 13.2495 28.8152 34.3846 22.6727 24.1969 8.1654 2.2238 13.8106 54.7523 40.0312
temp: 298.150 k
press: 1.00000 atm
elementType: 8 8 8 8 7 7 6 6 6 6 6 6 6 6 6 6 6 6 6 6 6 6 6 6 6 6 6 6 6 6 6 1 1 1 1 1 1 1 1 1 1 1 1 1 1 1 1 1 1 1 1 1 1
symmnumber: 1
zpe: 1082578.2 jmol-1
zpe.correction: 0.412332 hartree
zpe.thermalcorrener: 0.439033 hartree
zpe.thermalcorrenthalpy: 0.439977 hartree
zpe.thermalcorrgfe: 0.352293 hartree
zpe.sumelectzpe: -1373.990816 hartree
zpe.sumelectthermal: -1373.964115 hartree
zpe.sumelectthermalent: -1373.963171 hartree
zpe.sumelectthermalfe: -1374.050855 hartree
dipole: 2.0222 -3.3969 -5.9149
dipole: 7.1143
quadrupole: -172.5851 -158.3733 -172.5945
quadrupole: 0.2564 16.1978 13.3003
quadrupole: -4.7341 9.4777 -4.7436 0.2564 16.1978 13.3003
hfenergy: -1374.403148 hartree
pointgroup: C01 [X(C25H22N2O4)]
dipole: 0.0071235 1.5402984 -2.3370514 debye
polarizability: 261.715111|6.0766622|294.4565|9.9866001|-38.7417523|354.6690886 unknown
InChI: InChI=1S/C25H22N2O4/c28-24-13-11-21(27(30)31)14-20(24)16-26(15-18-6-2-1-3-7-18)17-23-22-9-5-4-8-19(22)10-12-25(23)29/h1-14,28-29H,15-17H2
charge 0 multiplicity 1
53 atoms
O  -2.399038 1.862968 -3.286712
O  3.176022 2.161212 -2.484486
O  3.980625 0.264199 3.567123
O  1.980573 -0.710526 3.061641
N  -0.001734 -0.410583 -1.353962
N  3.003045 0.022471 2.753993
C  -1.444037 -0.301616 -1.735968
C  0.807125 0.778368 -1.709084
C  -2.152607 0.880872 -1.095389
C  0.611297 -1.672865 -1.857526
C  -2.382013 0.945855 0.329624
C  2.00041 0.94821 -0.774668
C  0.065945 -2.923649 -1.177545
C  -3.097323 2.072693 0.899218
C  -2.639541 1.927798 -1.895008
C  -1.919666 -0.081429 1.221196
C  -3.574643 3.106744 0.030334
C  -3.352538 3.03946 -1.342396
C  3.17069 1.650202 -1.18007
C  1.962667 0.437563 0.534856
C  -3.319011 2.131258 2.314563
C  0.273229 -3.140112 0.210613
C  -0.632904 -3.905679 -1.922126
C  -2.148043 0.004091 2.596672
C  3.063877 0.603452 1.400437
C  -2.852553 1.117828 3.153409
C  4.272794 1.823246 -0.301954
C  4.226594 1.298823 1.000226
C  -0.210969 -4.30956 0.836159
C  -1.119818 -5.078777 -1.299095
C  -0.91047 -5.283315 0.08344
H  -1.925284 -1.242152 -1.407165
H  -1.563357 -0.239398 -2.840024
H  0.157759 1.669575 -1.619464
H  1.162809 0.763296 -2.764664
H  1.698712 -1.598634 -1.665874
H  0.481851 -1.767065 -2.965035
H  -1.367037 -0.930625 0.811251
H  -4.118679 3.956139 0.459321
H  -3.719506 3.83464 -2.005085
H  1.063931 -0.088191 0.864113
H  -3.862103 2.989933 2.727924
H  0.819112 -2.395811 0.802473
H  -0.796613 -3.750068 -2.996127
H  -1.776952 -0.786033 3.258441
H  -3.019586 1.171187 4.234661
H  5.164757 2.365631 -0.640418
H  5.060101 1.410619 1.697741
H  -0.038249 -4.463145 1.907366
H  -1.66029 -5.827503 -1.889406
H  -2.797213 2.644435 -3.743198
H  -1.285593 -6.190857 0.569862
H  4.031543 2.614526 -2.690208
