program: Gaussian 09
title: 000266646
version: EM64L-G09RevD.01
frameworkgroup: C1[X(C15H18ClN3O3)]
method: RPBEPBE
basis: SDD
operation: Freq
keyword: #p
keyword: freq=noraman
keyword: PBEPBE/SDD
title: #p freq=noraman PBEPBE/SDD
converged: YES YES NO NO
title: Mulliken charges:
elementType: Cl O O O N N N C C C C C C C C C C C C C C C H H H H H H H H H H H H H H H H H H
charge: -0.090530 -0.422096 -0.236007 -0.241120 -0.226713 -0.402382 -0.393027 -0.474068 -0.487245 0.147172 0.356485 0.254299 -0.617423 -0.052149 0.140444 -0.441490 0.369390 -0.783135 -0.096038 -0.402125 0.132339 -0.789477 0.253980 0.206613 0.254204 0.209205 0.238810 0.269592 0.197305 0.257288 0.349354 0.256089 0.256731 0.252471 0.367391 0.258616 0.209871 0.245818 0.237906 0.433653
chargesum: 0.00000
title: Mulliken charges with hydrogens summed into heavy atoms:
elementType: Cl O O O N N N C C C C C C C C C C C C C C C
charge: -0.090530 0.011557 -0.236007 -0.241120 -0.226713 -0.053028 -0.025636 -0.013476 -0.023837 0.147172 0.356485 0.254299 0.088284 -0.052149 0.140444 -0.184202 0.369390 -0.017844 -0.096038 -0.143509 0.132339 -0.095883
polarizability: 2.89229935e+02 1.15894693e+01 2.01819113e+02 -1.82241222e+01 -2.91243026e+00 1.34246234e+02
1716.lowfreq: -12.0775 -0.0022 -0.0021 -0.0016 3.4138 4.9976 17.4975 29.4333 34.9526
frequency: 14.7048 29.3603 34.8367 54.6151 73.4077 80.9933 98.8480 104.1867 127.2156 149.0416 165.1467 174.4922 177.0313 192.8749 231.6833 233.5222 248.6594 269.0871 305.1043 325.8674 328.8587 348.2966 357.8193 363.1554 372.5816 401.6213 450.5371 484.4107 500.4437 502.9024 534.3234 543.0122 552.9550 557.7599 590.4727 605.8438 632.7048 644.8080 702.8425 712.2792 735.1348 746.1554 775.6079 796.3715 827.7347 855.7020 866.9758 876.6319 901.0458 942.3237 963.7789 978.3547 992.0734 1011.7882 1020.8384 1034.2370 1046.2659 1046.6388 1070.7627 1099.6265 1125.6600 1138.4422 1167.3980 1185.9851 1217.7214 1223.2681 1227.7728 1249.5361 1266.1702 1283.6566 1303.1613 1325.4401 1355.7333 1360.6998 1377.3636 1385.3204 1399.4090 1404.1288 1415.8608 1423.7119 1435.2112 1446.6196 1452.6705 1453.3295 1462.8197 1466.4926 1474.3373 1478.5361 1479.7021 1480.4239 1497.5691 1595.1471 1612.7741 1621.9854 1653.3242 1684.6139 2663.3691 2915.6161 2921.9022 2936.0504 2983.1139 2986.1292 3003.4764 3046.4406 3055.0700 3059.1743 3061.3046 3092.8221 3105.1645 3135.8831 3144.2071 3155.7736 3528.0887 3549.1587
redmass: 6.4519 7.9233 5.1621 1.6220 2.2977 3.9445 3.5292 1.0726 6.1346 5.5305 8.8578 4.3240 3.9963 3.8379 1.5229 3.5705 1.8596 3.1908 3.5374 3.6808 3.6830 6.9512 3.6420 6.4630 8.5930 2.1777 4.7575 4.2374 4.0873 4.8796 4.1583 4.4837 4.0785 3.7229 4.0904 6.9927 1.4517 3.3990 2.0618 5.5644 4.2547 4.4748 2.3902 4.3834 4.5676 5.3293 1.5583 1.3421 2.2876 2.5668 2.7007 2.1024 1.9892 1.9039 1.6537 1.4269 1.5341 1.5214 2.2150 1.6855 1.5735 2.3318 2.6547 2.2207 2.8265 1.8695 4.8586 1.4655 2.1144 2.5474 1.6525 1.4443 1.9694 3.6632 1.5648 2.2441 1.2889 1.2413 2.8335 1.2162 2.1073 1.1385 2.0005 1.0564 1.1398 1.0585 1.1340 1.1735 1.1154 1.1573 1.7926 5.9548 6.8305 4.2108 6.5976 5.5286 1.0689 1.0529 1.0651 1.0660 1.0363 1.0407 1.0958 1.0917 1.0803 1.0975 1.0966 1.1006 1.1010 1.0949 1.0926 1.0925 1.0773 1.0778
irintensity: 0.4715 0.3365 2.7183 0.0540 0.2379 0.3706 1.7591 0.4658 1.5696 1.5144 4.6128 1.9726 1.7205 2.6670 0.1548 0.9608 0.1517 5.2960 10.5951 0.8760 6.7479 3.0344 10.0464 6.4449 12.0609 23.9836 12.8932 0.1325 2.5503 10.6870 4.7301 7.3570 3.0711 5.3529 1.7358 3.7818 66.5262 15.4043 7.5513 37.7036 40.9769 21.2037 107.2066 10.3579 42.0392 39.4622 24.2745 17.5811 0.7731 7.7181 5.0724 66.9221 60.1700 8.7540 24.5998 16.2261 6.8994 8.3743 2.7854 0.3558 4.9415 21.8312 33.7311 1.1178 64.8488 61.1808 42.3601 4.0332 7.6251 10.5731 46.1917 10.5524 49.2553 11.3838 11.5127 95.3862 25.7080 41.1668 13.8461 15.3395 139.6264 17.3248 83.3442 14.1169 27.3796 20.2591 8.1075 18.5086 31.0793 49.0079 65.4841 15.7363 90.5503 41.7525 305.9269 794.5429 1488.1845 36.2831 22.1806 85.9293 26.2554 17.4732 13.2550 4.9890 15.7915 12.3146 15.6164 21.3620 20.1405 9.1144 3.5287 3.3587 62.9278 74.8157
temp: 298.150 k
press: 1.00000 atm
elementType: 17 8 8 8 7 7 7 6 6 6 6 6 6 6 6 6 6 6 6 6 6 6 1 1 1 1 1 1 1 1 1 1 1 1 1 1 1 1 1 1
symmnumber: 1
zpe: 821482.2 jmol-1
zpe.correction: 0.312886 hartree
zpe.thermalcorrener: 0.334716 hartree
zpe.thermalcorrenthalpy: 0.335660 hartree
zpe.thermalcorrgfe: 0.260189 hartree
zpe.sumelectzpe: -1430.800203 hartree
zpe.sumelectthermal: -1430.778373 hartree
zpe.sumelectthermalent: -1430.777429 hartree
zpe.sumelectthermalfe: -1430.852900 hartree
dipole: 4.6287 -6.1895 -1.8594
dipole: 7.9493
quadrupole: -161.7751 -128.1947 -137.5841
quadrupole: -25.9418 -2.6808 0.1126
quadrupole: -19.2571 14.3233 4.9338 -25.9418 -2.6808 0.1126
hfenergy: -1431.1130888 hartree
pointgroup: C01 [X(C15H18Cl1N3O3)]
dipole: -1.9977896 2.2924757 -0.7312257 debye
polarizability: 287.6164049|17.8568356|203.9650005|15.7295964|3.1545403|133.7138769 unknown
InChI: InChI=1S/C15H18ClN3O3/c1-8-4-11(16)5-10(13(8)20)6-19(3)7-12-9(2)17-15(22)18-14(12)21/h4-5,17-18,20H,6-7H2,1-3H3
charge 0 multiplicity 1
40 atoms
Cl 6.460934 1.488222 -0.037204
O  1.167878 -1.381951 0.067468
O  -1.726932 -1.337925 1.98914
O  -5.666033 -1.894298 -0.477494
N  -0.012334 0.94435 0.324405
N  -4.525454 0.149571 -0.564978
N  -3.669485 -1.600413 0.731963
C  -1.254036 1.321781 1.072669
C  1.23422 1.33258 1.072321
C  -2.460299 0.530824 0.617852
C  2.467918 0.650826 0.499002
C  -3.457927 0.992004 -0.223815
C  -0.009936 1.448043 -1.073343
C  2.384103 -0.708076 0.067591
C  -2.55069 -0.83721 1.170737
C  3.712625 1.319783 0.457102
C  3.542831 -1.410518 -0.375165
C  -3.539795 2.367612 -0.84589
C  4.847101 0.620719 0.013926
C  4.779849 -0.726257 -0.393853
C  -4.691853 -1.180085 -0.125708
C  3.41886 -2.854904 -0.807365
H  -1.073281 1.068537 2.132661
H  -1.43337 2.417944 1.0098
H  1.081331 0.998813 2.118065
H  1.373953 2.437199 1.086725
H  -0.873252 1.031247 -1.618284
H  0.911218 1.116141 -1.579163
H  -0.053234 2.560682 -1.117273
H  3.792219 2.364373 0.776028
H  -5.263751 0.485916 -1.187227
H  -2.677388 2.990765 -0.574927
H  -4.457348 2.890385 -0.515983
H  -3.572501 2.29675 -1.949644
H  -3.740796 -2.55789 1.09075
H  5.682635 -1.245202 -0.730998
H  4.38814 -3.258401 -1.146091
H  3.042735 -3.481672 0.021956
H  2.682511 -2.958624 -1.625464
H  0.428932 -0.666642 0.243107
