program: Gaussian 09
title: 000266645
version: EM64L-G09RevD.01
frameworkgroup: C1[X(C15H15NO3)]
method: RPBEPBE
basis: SDD
operation: Freq
keyword: #p
keyword: freq=noraman
keyword: PBEPBE/SDD
title: #p freq=noraman PBEPBE/SDD
converged: YES YES NO NO
title: Mulliken charges:
elementType: O O O N C C C C C C C C C C C C C C C H H H H H H H H H H H H H H H
charge: -0.204388 -0.295929 -0.215420 -0.104049 0.128530 -0.449213 0.003965 0.237160 -0.296519 0.481715 0.172302 -0.607087 -0.387209 -0.615006 -0.449319 -0.252745 0.132347 -0.251007 -0.500960 0.200970 0.240198 0.202505 0.234099 0.281461 0.241285 0.231316 0.197106 0.229431 0.247843 0.226661 0.230922 0.238150 0.228271 0.242611
chargesum: 0.00000
title: Mulliken charges with hydrogens summed into heavy atoms:
elementType: O O O N C C C C C C C C C C C C C C C
charge: -0.204388 -0.295929 -0.215420 -0.104049 0.128530 -0.008044 0.003965 0.237160 0.140085 0.481715 0.172302 -0.325626 -0.145924 0.042846 -0.201476 -0.026084 0.132347 -0.020084 0.208072
polarizability: 2.39843418e+02 -2.44329728e+01 2.42311875e+02 -3.11943387e-01 -5.52941861e+00 9.06400252e+01
1716.lowfreq: -9.6878 -0.0005 -0.0002 0.0007 3.8606 7.4821 26.9694 53.4542 70.0729
frequency: 26.9638 53.4469 70.0684 92.8714 104.9110 118.3009 138.3028 156.8289 169.3201 175.6687 211.8312 253.1564 282.3754 295.2953 308.9282 330.5962 344.2349 365.8172 394.9802 429.8338 455.2285 516.2640 535.5010 546.2718 560.0134 596.4201 649.2693 661.7624 693.8874 720.2611 752.6828 762.9119 799.4687 812.8587 858.3923 868.1148 875.1592 913.3084 933.6007 963.1548 967.7781 987.7140 988.7244 991.5352 1030.5889 1034.3849 1062.5420 1083.8762 1113.5444 1113.6254 1126.5170 1144.7848 1173.2708 1175.7553 1187.3068 1200.5400 1219.2785 1261.6587 1269.6815 1286.8838 1296.0879 1343.3213 1352.7640 1382.3644 1409.4788 1419.2394 1423.6475 1434.6811 1437.4931 1447.6946 1450.7038 1462.6477 1465.5606 1466.5011 1479.9815 1489.9918 1513.0962 1578.4273 1591.5544 1630.6546 1639.0171 2810.4266 2856.5763 2876.2524 2999.3881 3000.9536 3020.9479 3080.3295 3098.7064 3101.2791 3123.6122 3131.0912 3141.7138 3148.3743 3164.0294 3166.2903
redmass: 6.7827 4.0125 3.2995 2.9129 1.7846 1.8361 3.5635 2.8459 3.7603 3.7264 1.2391 5.2588 5.0384 3.1178 2.8614 4.6246 3.7200 4.3718 4.5434 4.5805 4.6812 3.6213 4.7382 3.9900 5.2479 6.5154 6.1495 6.7887 6.0698 5.5186 2.9518 1.6581 2.8618 5.7478 5.1191 1.6009 4.5381 5.9632 1.5261 5.1745 1.5174 1.5929 5.1439 1.5682 2.2432 2.1187 2.0997 2.8318 1.2689 1.3333 2.8342 1.4222 1.2249 1.9839 1.5924 1.1402 1.4713 2.1022 3.2645 1.6602 2.2107 2.2484 1.9743 1.6229 4.2741 1.8323 1.8026 1.4316 1.8154 3.5779 1.0500 1.0580 1.0560 1.1422 1.1361 1.0986 3.3875 7.9264 6.5934 6.8933 9.9900 1.0712 1.0684 1.0581 1.0297 1.0852 1.0746 1.1005 1.1041 1.0924 1.0856 1.0886 1.1044 1.0944 1.1000 1.0923
irintensity: 2.1755 3.7098 1.0460 0.3507 0.7879 0.8168 0.9092 2.3780 2.4282 1.7990 1.0060 5.2954 5.2341 4.6322 10.1279 5.0269 1.8980 5.4099 9.2881 2.5047 9.6514 9.2019 0.4427 1.0304 2.9034 5.1008 1.7803 6.5030 9.1378 0.7639 7.6411 67.3977 13.4506 29.5784 25.1391 4.4952 9.5090 29.2497 12.8381 76.8081 10.1683 3.8867 81.4133 1.9455 5.3252 122.1417 21.4208 27.7940 0.7698 13.3627 200.8251 25.4176 38.1850 168.3152 73.4056 15.1463 54.4866 1.8117 51.7650 13.7329 58.3692 14.9529 21.8923 12.0355 46.9969 7.1210 15.0724 18.8421 7.7526 33.4980 13.0920 21.0870 12.6571 1.5567 9.7464 14.8473 21.8815 8.1461 6.3085 10.3980 356.4053 65.1862 78.4643 211.8487 50.6730 17.7476 42.5797 20.1768 28.3541 31.4055 2.2065 3.7865 16.9613 30.5768 31.8607 2.8884
temp: 298.150 k
press: 1.00000 atm
elementType: 8 8 8 7 6 6 6 6 6 6 6 6 6 6 6 6 6 6 6 1 1 1 1 1 1 1 1 1 1 1 1 1 1 1
symmnumber: 1
zpe: 703722.0 jmol-1
zpe.correction: 0.268034 hartree
zpe.thermalcorrener: 0.285018 hartree
zpe.thermalcorrenthalpy: 0.285962 hartree
zpe.thermalcorrgfe: 0.222742 hartree
zpe.sumelectzpe: -859.635279 hartree
zpe.sumelectthermal: -859.618295 hartree
zpe.sumelectthermalent: -859.617351 hartree
zpe.sumelectthermalfe: -859.680571 hartree
dipole: -2.8324 0.6223 0.3623
dipole: 2.9225
quadrupole: -91.3895 -97.3304 -115.5459
quadrupole: 12.3728 -2.7643 -0.5918
quadrupole: 10.0324 4.0915 -14.1239 12.3728 -2.7643 -0.5918
hfenergy: -859.9033126 hartree
pointgroup: C01 [X(C15H15N1O3)]
dipole: 1.115354 -0.2253668 -0.1650038 debye
polarizability: 258.3809318|17.4087575|223.5950649|-0.5654482|7.0862741|90.819321 unknown
InChI: InChI=1S/C15H15NO3/c1-16-8-13-11-6-4-3-5-10(11)7-12(15(17)18-2)14(13)19-9-16/h3-7H,8-9H2,1-2H3
charge 0 multiplicity 1
34 atoms
O  -1.460141 -1.813942 -0.107426
O  -3.081966 2.01974 0.477419
O  -3.567813 -0.046049 -0.477729
N  0.421954 -3.262793 0.27938
C  0.796563 -0.84937 -0.068501
C  1.433633 -2.234393 -0.017572
C  -0.605198 -0.710083 -0.070863
C  1.628985 0.322833 -0.068416
C  -0.784989 -3.070651 -0.502139
C  1.013207 1.632613 -0.005967
C  -1.228577 0.59453 -0.00672
C  -0.408997 1.728365 0.041344
C  3.063273 0.252471 -0.112775
C  0.931092 -4.637309 0.362067
C  1.836821 2.80571 0.012267
C  3.841435 1.413615 -0.096712
C  -2.712908 0.757574 -0.042523
C  3.228214 2.704515 -0.03215
C  -4.531809 2.306676 0.437032
H  1.979561 -2.44277 -0.977184
H  2.191251 -2.258917 0.789379
H  -0.59977 -2.98915 -1.603378
H  -1.51262 -3.870163 -0.2988
H  -0.882158 2.712525 0.101408
H  3.560143 -0.721763 -0.168399
H  1.72438 -4.689873 1.129433
H  1.3600 -5.018224 -0.597733
H  0.118015 -5.317735 0.671249
H  1.351385 3.787641 0.061678
H  4.93405 1.337782 -0.135012
H  3.852483 3.604075 -0.018596
H  -4.900083 2.296301 -0.60332
H  -4.63312 3.306198 0.883687
H  -5.088694 1.553322 1.01967
