program: Gaussian 09
title: 000266636
version: EM64L-G09RevD.01
frameworkgroup: C1[X(C24H16BrN3O)]
method: RPBEPBE
basis: SDD
operation: Freq
keyword: #p
keyword: freq=noraman
keyword: PBEPBE/SDD
title: #p freq=noraman PBEPBE/SDD
converged: YES YES NO NO
title: Mulliken charges:
elementType: Br O N N N C C C C C C C C C C C C C C C C C C C C C C C C H H H H H H H H H H H H H H H H
charge: -0.001896 -0.198758 -0.482434 -0.410197 -0.406794 -0.086660 0.436981 0.472341 -0.010956 0.144480 0.256910 0.072635 0.095307 -0.440653 -0.451276 0.204571 0.201744 -0.298148 -0.374302 -0.399090 -0.352010 -0.353902 -0.362455 -0.253909 -0.126380 -0.269770 -0.278332 -0.217247 -0.214709 0.312690 0.294331 0.277006 0.308929 0.304066 0.282741 0.243626 0.242561 0.252308 0.229907 0.226024 0.248020 0.221022 0.218962 0.222946 0.219771
chargesum: 0.00000
title: Mulliken charges with hydrogens summed into heavy atoms:
elementType: Br O N N N C C C C C C C C C C C C C C C C C C C C C C C C
charge: -0.001896 -0.198758 -0.169745 -0.101268 -0.102728 -0.086660 0.436981 0.472341 -0.010956 0.144480 0.256910 0.072635 0.095307 -0.146323 -0.174270 0.204571 0.201744 -0.015406 -0.130677 -0.156529 -0.099702 -0.123995 -0.136431 -0.253909 0.121640 -0.048748 -0.059370 0.005699 0.005061
polarizability: 4.06967262e+02 5.38168361e+00 2.49337583e+02 -2.37989070e+00 -1.09776942e+01 2.66531846e+02
1716.lowfreq: -10.7185 -5.2878 -0.0007 -0.0004 0.0004 2.0698 14.6456 22.1330 31.5200
frequency: 14.5364 22.0137 31.4972 42.5187 54.9754 69.3549 108.3144 127.5606 135.6506 144.5750 158.0279 168.6320 220.6326 221.8319 226.0156 240.6851 261.2574 294.7526 317.1518 334.8071 349.7862 377.0758 407.6098 418.8236 422.1818 426.6061 448.1105 467.3977 511.5629 512.5317 528.5135 540.6746 544.6072 556.0444 573.9036 576.5329 591.5220 606.9786 617.5663 633.9771 644.5033 663.4870 668.9833 703.6449 747.9594 749.2215 751.1611 756.5861 760.0095 765.4006 768.7478 798.8519 809.3535 818.3632 829.5140 849.7994 853.0564 863.9164 867.7544 874.2818 883.8115 914.5803 934.3298 934.8028 951.0225 973.2660 973.5515 974.4212 1012.0896 1013.5146 1018.0611 1045.2648 1078.7413 1086.2479 1097.6281 1101.9335 1121.0942 1134.5282 1138.2174 1167.6912 1168.6215 1177.2977 1228.7434 1246.0898 1247.3843 1248.1382 1253.4859 1283.2586 1288.9880 1298.9340 1331.7077 1338.1698 1355.9500 1382.9866 1384.3111 1404.8793 1418.9400 1419.5472 1434.0217 1455.8559 1457.8680 1464.6085 1482.3428 1484.0906 1545.8268 1549.6743 1578.8092 1584.0545 1584.9664 1618.3898 1624.4190 1630.8935 1631.8437 3124.2740 3124.8175 3132.4217 3137.0692 3144.4061 3145.7406 3155.7908 3163.3337 3166.7514 3169.0723 3176.0582 3233.7874 3235.0727 3578.1746 3611.1326 3612.4209
redmass: 9.1153 5.6302 5.3766 5.2919 5.6724 5.8111 6.7975 8.4257 5.8753 5.2663 6.7331 7.5566 4.2108 4.0707 7.6786 6.7565 6.5591 7.0647 6.3143 6.6511 5.7533 1.6544 2.8606 3.2308 2.8226 3.0238 4.4154 4.2966 1.5803 2.3255 1.3111 5.6009 6.8510 7.4159 3.0015 3.0038 4.6317 4.9702 4.7094 6.4536 4.1597 5.1068 4.8872 6.6571 1.3898 3.9493 1.4097 5.0356 3.8877 4.6500 3.9609 2.0253 1.5564 1.8161 1.8988 1.5068 1.4942 4.7624 4.9867 5.6652 6.0605 1.5223 1.3829 1.3852 1.3507 1.3969 1.4310 3.3969 2.1413 2.1536 6.2388 2.0418 4.4239 3.0338 1.7775 1.6415 2.2517 1.4377 1.4642 1.0924 1.1067 1.8814 2.4474 1.5914 1.5901 1.5642 2.4655 2.0586 2.1625 2.3735 2.2744 2.1691 3.5138 4.1406 4.2419 3.0869 2.5425 2.5140 3.6150 3.9185 3.9672 3.9077 3.0132 3.0183 6.0833 5.8487 7.1961 6.2487 6.2992 8.9410 10.7506 6.9765 6.9524 1.0854 1.0849 1.0891 1.0907 1.0887 1.0953 1.0967 1.1001 1.0942 1.0956 1.0967 1.0989 1.0978 1.0794 1.0810 1.0809
irintensity: 0.0259 0.0751 0.5639 1.3555 1.3444 2.0750 1.4657 0.5784 0.2142 0.4664 2.3996 0.4610 6.9381 6.0885 2.6003 2.3904 2.0964 0.4220 3.1278 3.2619 0.4893 58.1084 48.8992 0.7425 12.0347 35.8291 6.0902 2.7240 42.6973 66.1798 84.3569 2.9753 10.3282 4.6579 9.6240 9.8313 18.5101 3.4956 7.5328 18.4867 13.6627 10.7290 6.6938 41.2226 96.5550 4.1385 100.2806 5.0194 15.4575 7.3317 11.4310 30.7333 40.1574 27.6304 0.8915 0.2744 0.2088 0.5145 1.6538 6.5755 5.4586 13.7357 3.1175 2.6354 1.0968 0.5429 0.4028 2.4209 17.1838 17.3582 48.2966 10.7088 11.4346 10.4702 46.4652 33.5657 68.7750 3.7416 1.7566 1.2946 2.2001 73.6873 1.6511 17.7411 25.3387 22.1244 11.7525 5.2174 4.4403 1.6953 40.0437 9.3782 26.2846 57.3333 33.5276 25.6893 5.7176 7.8283 75.4064 28.9513 10.5469 289.3623 0.5882 3.2945 33.3101 10.6245 14.5034 2.2624 2.1836 298.1389 96.8980 9.1225 10.7495 0.5229 1.4314 4.3549 18.8401 4.6624 31.6544 39.5051 31.3742 2.2112 8.1844 11.0289 1.1806 0.1651 51.3148 72.6517 57.8642
temp: 298.150 k
press: 1.00000 atm
elementType: 35 8 7 7 7 6 6 6 6 6 6 6 6 6 6 6 6 6 6 6 6 6 6 6 6 6 6 6 6 1 1 1 1 1 1 1 1 1 1 1 1 1 1 1 1
symmnumber: 1
zpe: 884767.7 jmol-1
zpe.correction: 0.336990 hartree
zpe.thermalcorrener: 0.359957 hartree
zpe.thermalcorrenthalpy: 0.360901 hartree
zpe.thermalcorrgfe: 0.282377 hartree
zpe.sumelectzpe: -1175.167427 hartree
zpe.sumelectthermal: -1175.144460 hartree
zpe.sumelectthermalent: -1175.143516 hartree
zpe.sumelectthermalfe: -1175.222040 hartree
dipole: 2.6788 -2.6139 3.3903
dipole: 5.0500
quadrupole: -184.3787 -161.7796 -152.0974
quadrupole: 0.9747 -4.9998 16.5083
quadrupole: -18.2935 4.3056 13.9879 0.9747 -4.9998 16.5083
hfenergy: -1175.5044175 hartree
pointgroup: C01 [X(C24H16Br1N3O1)]
dipole: 1.0294718 -1.122616 1.2756761 debye
polarizability: 407.050205|4.9046237|250.8632999|0.0249695|-11.9668033|264.9231857 unknown
InChI: InChI=1S/C24H16BrN3O/c25-14-9-10-22-17(11-14)23(29)24(28-22,18-12-26-20-7-3-1-5-15(18)20)19-13-27-21-8-4-2-6-16(19)21/h1-13,26-28H
charge 0 multiplicity 1
45 atoms
Br -7.027721 0.211676 -0.504338
O  -1.294123 1.110223 -1.953098
N  -1.185653 -0.765586 1.133156
N  1.324539 -2.51816 -2.218251
N  1.095285 2.679565 2.154032
C  -0.378289 -0.078177 0.074998
C  0.501985 -1.082826 -0.649209
C  0.396986 1.087404 0.676837
C  -1.510416 0.488544 -0.879054
C  -2.797821 0.123627 -0.270074
C  -2.544235 -0.671951 0.8903
C  1.609517 -1.821177 -0.060662
C  1.385875 1.924174 0.013425
C  0.362345 -1.535322 -1.960713
C  0.241843 1.585128 1.971194
C  2.101346 -2.722458 -1.070344
C  1.811692 2.910953 0.971921
C  -4.112416 0.402522 -0.705052
C  -3.626719 -1.228934 1.621207
C  2.238683 -1.811397 1.214118
C  1.949675 1.950797 -1.29043
C  3.177653 -3.606647 -0.839283
C  2.778189 3.896943 0.673309
C  -5.170985 -0.14149 0.039571
C  -4.937988 -0.952609 1.184772
C  3.310657 -2.692655 1.451485
C  2.914092 2.929139 -1.594032
C  3.773584 -3.58335 0.437893
C  3.327072 3.890932 -0.62415
H  -0.75955 -1.474556 1.729023
H  -0.336703 -1.210617 -2.728023
H  -0.417533 1.238375 2.763141
H  1.447612 -2.99725 -3.107363
H  1.179167 3.222834 3.009924
H  -4.278049 1.016209 -1.595209
H  -3.462048 -1.853177 2.505199
H  1.917828 -1.105312 1.988181
H  1.622143 1.231853 -2.046021
H  3.542236 -4.285526 -1.618262
H  3.090046 4.640656 1.415241
H  -5.789575 -1.366097 1.734014
H  3.809638 -2.689953 2.426877
H  3.354004 2.96155 -2.596904
H  4.612191 -4.254577 0.653687
H  4.079139 4.640501 -0.895131
