program: Gaussian 09
title: 000266618
version: EM64L-G09RevD.01
frameworkgroup: C1[X(C18H14ClNO4)]
method: RPBEPBE
basis: SDD
operation: Freq
keyword: #p
keyword: freq=noraman
keyword: PBEPBE/SDD
title: #p freq=noraman PBEPBE/SDD
converged: YES YES NO NO
title: Mulliken charges:
elementType: Cl O O O O N C C C C C C C C C C C C C C C C C C H H H H H H H H H H H H H H
charge: -0.019209 -0.270895 -0.294392 -0.241284 -0.230247 -0.096751 0.596436 -0.369318 -0.540744 0.040722 0.241377 -0.459181 0.294356 0.090402 -0.292455 0.301521 0.138721 -0.369149 -0.339785 -0.221329 -0.225418 -0.229671 -0.534930 -0.490807 0.256833 0.321257 0.262681 0.270176 0.270079 0.232935 0.232646 0.233458 0.241677 0.239226 0.243370 0.228787 0.252842 0.236064
chargesum: 0.00000
title: Mulliken charges with hydrogens summed into heavy atoms:
elementType: Cl O O O O N C C C C C C C C C C C C C C C C C C
charge: -0.019209 -0.270895 -0.294392 -0.241284 -0.230247 -0.096751 0.596436 -0.112485 -0.219487 0.040722 0.241377 -0.196500 0.294356 0.090402 -0.292455 0.301521 0.138721 -0.098972 -0.069706 0.011606 0.007228 0.003787 0.189343 0.226887
polarizability: 6.22792513e+02 1.10867944e+01 2.41856705e+02 -7.75629512e-01 2.54513591e-01 9.41121285e+01
1716.lowfreq: -3.7635 -0.0020 -0.0017 -0.0010 2.2349 6.2329 23.9351 30.8376 38.9955
frequency: 23.9127 30.8108 38.9896 50.4936 62.9797 77.8838 86.5208 100.9796 119.4926 161.1057 162.2354 167.7579 197.4120 200.4851 209.2020 210.4177 216.2532 272.9043 295.7225 317.6133 329.4439 340.0254 383.2363 392.7616 402.6765 406.3359 425.8067 491.0459 509.5018 534.3482 535.5395 570.9556 612.4883 625.0317 640.8037 655.2126 673.0827 697.5530 708.8937 741.9206 746.5925 755.7992 771.2469 784.2729 811.7571 821.6432 858.4872 860.6936 926.0019 926.5675 946.0178 960.3217 962.0344 965.7157 987.9325 992.3736 1006.0790 1015.9185 1029.6453 1043.0538 1084.9126 1107.0183 1110.1969 1125.4280 1129.7846 1158.5883 1163.8678 1174.4782 1186.5432 1235.3475 1249.4210 1280.9355 1299.2752 1320.4173 1357.0803 1387.2900 1391.8605 1423.6033 1436.3514 1438.5935 1447.4259 1456.1274 1461.0540 1468.6906 1469.3117 1469.9129 1483.1527 1534.5216 1539.7851 1583.2334 1595.0522 1609.7462 1635.0955 1670.8587 2982.4073 3006.4641 3078.4085 3111.7549 3119.4880 3131.7243 3135.4040 3141.6010 3143.3484 3155.6406 3156.2616 3161.4764 3166.4777 3174.8228
redmass: 5.2344 4.7736 3.5142 5.9339 5.5047 4.1157 6.0018 5.4038 3.4604 6.3097 6.6959 1.6525 4.9455 2.0733 6.6601 4.7031 3.8787 2.0662 3.3014 5.3324 5.3632 6.4384 7.8631 7.0047 2.9071 5.5493 4.2394 4.1296 7.0529 7.5220 5.3503 7.1698 6.4413 4.2321 6.1423 7.7187 6.3345 1.7619 7.5426 6.6165 8.8099 4.6933 7.7668 1.9116 11.1897 9.1684 1.4512 1.2466 8.8245 1.3563 1.4196 9.0400 1.5586 7.8421 6.2354 1.3831 1.3293 4.1374 2.9641 3.0289 1.7223 1.2440 1.2602 4.7072 1.9763 1.8122 1.4979 1.0578 1.1164 1.8017 2.6778 3.6245 2.6635 1.3529 2.5954 8.4806 3.0690 1.6139 1.7853 2.1331 1.5880 1.0734 1.0642 1.0847 1.3408 2.1420 1.8615 6.7455 6.7247 6.1023 6.1572 6.2020 8.5284 10.3453 1.0314 1.0294 1.1047 1.0873 1.1034 1.0854 1.1021 1.1063 1.0889 1.0928 1.0934 1.0928 1.0964 1.1004
irintensity: 1.7869 1.1525 3.7772 1.8797 4.9965 9.1725 0.3053 2.0907 2.5551 1.2480 0.4614 1.5999 2.3413 0.5152 0.5632 2.4831 2.7543 0.4203 0.0365 4.6132 9.1554 6.9790 2.5735 1.6977 0.3776 10.9968 8.6427 1.5837 8.3481 4.6610 3.1217 6.9772 3.2562 2.4372 61.7444 1.2164 29.9690 58.5565 3.3406 21.6108 7.0973 41.8920 17.5252 44.8788 199.7728 100.1181 6.9568 0.0088 46.2486 11.4165 5.3988 69.7800 36.7420 110.3120 1.4550 0.0139 0.3870 53.8410 48.3066 57.0482 9.9338 3.5250 0.0405 39.5316 9.6698 73.2837 20.7284 0.0647 14.7207 6.3625 40.1859 85.8910 676.1418 7.6833 51.9795 2.6747 111.8869 35.5134 33.4861 41.7424 59.6393 29.2921 24.0590 49.6053 160.6745 16.7321 194.7550 18.5176 102.4091 43.1086 199.6404 8.5347 338.9328 140.4805 27.6695 95.0303 29.1648 4.5639 31.4415 0.7931 26.1226 17.9758 10.9338 29.6416 20.1039 0.5743 14.5145 28.3023
temp: 298.150 k
press: 1.00000 atm
elementType: 17 8 8 8 8 7 6 6 6 6 6 6 6 6 6 6 6 6 6 6 6 6 6 6 1 1 1 1 1 1 1 1 1 1 1 1 1 1
symmnumber: 1
zpe: 729735.4 jmol-1
zpe.correction: 0.277942 hartree
zpe.thermalcorrener: 0.299709 hartree
zpe.thermalcorrenthalpy: 0.300654 hartree
zpe.thermalcorrgfe: 0.225051 hartree
zpe.sumelectzpe: -1508.292200 hartree
zpe.sumelectthermal: -1508.270432 hartree
zpe.sumelectthermalent: -1508.269487 hartree
zpe.sumelectthermalfe: -1508.345090 hartree
dipole: 0.3668 1.6885 0.6881
dipole: 1.8599
quadrupole: -116.4561 -137.3998 -149.1642
quadrupole: -20.0855 -4.3947 0.2600
quadrupole: 17.8839 -3.0597 -14.8242 -20.0855 -4.3947 0.2600
hfenergy: -1508.5701411 hartree
pointgroup: C01 [X(C18H14Cl1N1O4)]
dipole: -0.0625307 0.5420442 -0.4875582 debye
polarizability: 615.3874153|-43.9830111|229.6561913|31.9075403|-50.9356735|113.7177402 unknown
InChI: InChI=1S/C18H14ClNO4/c1-22-15-10-11(8-13(19)16(15)23-2)9-14-18(21)24-17(20-14)12-6-4-3-5-7-12/h3-10H,1-2H3
charge 0 multiplicity 1
38 atoms
Cl 4.958551 -3.178796 1.554098
O  -2.263333 1.451709 -0.40466
O  4.464472 1.699854 -0.169284
O  5.997382 -0.595321 0.668296
O  -0.007241 2.079211 -0.530511
N  -2.091455 -0.713988 0.395812
C  1.747231 -0.801387 0.579509
C  0.313687 -1.006868 0.601656
C  2.391705 0.40461 0.16644
C  -0.768121 -0.200701 0.264728
C  3.790377 0.52124 0.180255
C  2.563713 -1.891667 1.01217
C  4.620179 -0.583503 0.588098
C  -2.918301 0.243768 0.008883
C  3.955346 -1.769844 1.00915
C  -4.374595 0.219009 -0.04615
C  -0.842477 1.195593 -0.247288
C  -5.066423 -0.957956 0.356307
C  -5.10659 1.352373 -0.495911
C  -6.472586 -0.996019 0.307699
C  -6.514865 1.304297 -0.540961
C  -7.201523 0.133573 -0.140569
C  3.641434 2.855891 -0.562728
C  6.85002 0.294577 -0.152228
H  -0.005608 -1.99872 0.951834
H  1.772759 1.247209 -0.149841
H  2.104468 -2.829419 1.339425
H  -4.485236 -1.819815 0.699463
H  -4.565383 2.252318 -0.803353
H  -7.003704 -1.902335 0.617804
H  -7.077672 2.177639 -0.887543
H  -8.296037 0.100331 -0.176966
H  3.04092 2.631814 -1.463301
H  4.365448 3.654677 -0.778711
H  2.969317 3.162247 0.259505
H  6.540886 0.26266 -1.210698
H  6.804584 1.329221 0.21734
H  7.858669 -0.12818 -0.031567
