program: Gaussian 09
title: 000266616
version: EM64L-G09RevD.01
frameworkgroup: C1[X(C17H15NO2)]
method: RPBEPBE
basis: SDD
operation: Freq
keyword: #p
keyword: freq=noraman
keyword: PBEPBE/SDD
title: #p freq=noraman PBEPBE/SDD
converged: YES YES NO NO
title: Mulliken charges:
elementType: O O N C C C C C C C C C C C C C C C C C H H H H H H H H H H H H H H H
charge: -0.245210 -0.277270 -0.409430 0.219867 0.152653 0.215518 -0.658724 0.115383 -0.354260 0.540061 -0.393612 -0.355089 -0.590591 -0.242829 -0.406661 -0.212812 0.343662 -0.209781 -0.387678 -0.536897 0.255471 0.217043 0.277596 0.313007 0.287453 0.230505 0.253321 0.224704 0.259921 0.223897 0.222823 0.242332 0.222707 0.219694 0.243225
chargesum: 0.00000
title: Mulliken charges with hydrogens summed into heavy atoms:
elementType: O O N C C C C C C C C C C C C C C C C C
charge: -0.245210 -0.277270 -0.096422 0.219867 0.152653 0.215518 -0.186210 0.115383 -0.076664 0.540061 -0.106158 -0.124584 -0.337270 -0.018125 -0.146741 0.011086 0.343662 0.013042 -0.145346 0.148729
polarizability: 2.62689342e+02 1.60264548e+01 1.93840868e+02 1.80337013e+01 1.14130285e+01 1.36785055e+02
1716.lowfreq: -9.8719 -0.0004 -0.0004 0.0003 0.8321 4.7425 16.5336 24.6289 28.0292
frequency: 12.1149 24.3705 27.9782 84.6913 103.3302 117.4888 127.2311 187.4568 204.3811 207.4417 221.5833 261.9929 282.2389 290.2934 334.3116 395.0362 426.3744 439.5693 448.5301 489.9712 499.5511 540.4462 551.4393 565.2051 570.0738 582.9734 600.3013 629.9495 664.0074 694.9854 706.3986 749.5103 758.3373 764.4478 777.6786 793.7018 824.8471 865.5650 867.9101 873.8584 885.1910 889.6145 927.2403 949.0577 972.8787 981.7051 984.5816 991.4133 1009.9633 1016.6559 1089.3685 1095.3643 1113.2062 1122.8048 1141.3602 1143.1556 1161.4606 1164.9881 1186.6582 1188.4327 1244.9311 1248.3055 1254.2083 1270.5970 1301.2553 1304.9215 1357.5302 1387.7814 1394.7827 1423.0794 1433.1853 1447.9677 1451.0460 1456.0421 1466.0549 1474.8647 1478.3651 1483.7274 1524.9218 1566.1896 1589.0030 1590.7352 1619.1304 1632.1786 2958.2691 3003.0774 3045.2864 3064.5414 3123.0647 3127.9794 3130.2613 3135.1598 3140.4305 3150.9642 3159.6596 3167.5493 3183.4723 3233.0571 3598.8252
redmass: 4.8797 5.3937 4.9936 3.7091 5.7048 5.2115 5.5926 2.5729 2.6423 3.1230 3.9332 1.8436 4.8176 3.9997 2.8935 5.9540 2.9264 3.3454 4.0035 5.0826 5.0960 4.4526 4.2149 2.4229 3.8070 2.0515 3.4732 3.0016 5.1382 2.4774 4.1096 3.0194 1.4162 4.9182 2.5138 1.8209 1.7694 2.8480 1.7118 2.4932 1.9402 1.4946 3.3787 1.3711 1.4107 3.9906 3.6249 1.3095 2.0918 3.8269 1.9268 1.8020 1.2595 1.5231 1.6056 1.3199 1.3681 1.1358 1.1630 1.6469 1.6563 3.4943 2.6752 1.5360 1.9035 1.4889 2.6089 7.7909 5.8298 2.4895 1.3476 2.0665 3.6407 1.1518 1.0507 1.0997 2.1949 3.0658 5.3481 7.9605 6.1083 6.6086 6.6256 7.1343 1.0330 1.0589 1.1039 1.1025 1.0992 1.0858 1.0865 1.0916 1.0913 1.0934 1.0975 1.0970 1.0965 1.0982 1.0810
irintensity: 2.5418 0.8798 0.4671 7.2382 3.4528 0.1969 2.0584 0.8163 1.3960 3.8771 8.9520 0.4715 1.1871 2.8521 0.9797 0.2289 11.9072 2.4643 1.2111 6.2442 3.8762 4.8816 11.7805 33.8496 4.3529 42.9632 28.2503 14.8554 3.6899 8.6859 32.5476 29.5037 106.9692 19.0919 40.5708 16.1151 6.0380 2.2238 2.1979 3.5878 4.3500 11.8135 30.0081 4.1641 1.5981 8.2116 26.4711 0.9052 16.5570 73.8506 10.5399 12.1229 0.3167 84.2408 42.0786 3.0866 25.1409 13.1917 0.3189 28.8450 39.8490 102.1378 13.6001 18.7334 12.9227 8.7645 9.0669 22.5148 93.7903 81.1330 23.0372 15.9155 32.0995 16.9626 13.0065 28.5554 48.4881 0.3698 75.6216 264.7260 51.6805 6.0222 98.1405 1.7089 71.1745 18.0790 49.0623 9.6524 26.8480 0.2533 5.6761 8.2053 20.1120 8.2625 29.7281 15.6058 7.4826 0.7750 63.8101
temp: 298.150 k
press: 1.00000 atm
elementType: 8 8 7 6 6 6 6 6 6 6 6 6 6 6 6 6 6 6 6 6 1 1 1 1 1 1 1 1 1 1 1 1 1 1 1
symmnumber: 1
zpe: 724967.3 jmol-1
zpe.correction: 0.276125 hartree
zpe.thermalcorrener: 0.293137 hartree
zpe.thermalcorrenthalpy: 0.294082 hartree
zpe.thermalcorrgfe: 0.228831 hartree
zpe.sumelectzpe: -860.608617 hartree
zpe.sumelectthermal: -860.591605 hartree
zpe.sumelectthermalent: -860.590661 hartree
zpe.sumelectthermalfe: -860.655912 hartree
dipole: -2.1694 -5.5240 0.4526
dipole: 5.9520
quadrupole: -99.4052 -110.6271 -113.5540
quadrupole: -3.2956 -4.7034 3.0990
quadrupole: 8.4569 -2.7650 -5.6919 -3.2956 -4.7034 3.0990
hfenergy: -860.8847428 hartree
pointgroup: C01 [X(C17H15N1O2)]
dipole: 0.659071 0.7227205 -2.1276339 debye
polarizability: 255.6706018|-19.7497914|136.7110759|-27.3309031|-2.1230848|200.9335875 unknown
InChI: InChI=1S/C17H15NO2/c1-20-13-6-4-5-12(9-13)10-17(19)15-11-18-16-8-3-2-7-14(15)16/h2-9,11,18H,10H2,1H3
charge 0 multiplicity 1
35 atoms
O  -0.916013 -1.171316 2.644266
O  4.446119 -0.400443 -1.861831
N  -1.960277 -0.061275 -1.759757
C  -1.307011 -0.694739 0.332406
C  -2.608424 -0.036946 0.43459
C  -2.994305 0.347769 -0.893451
C  0.831063 -1.932578 1.123945
C  -0.517559 -1.249529 1.437098
C  -0.956636 -0.681254 -1.030365
C  1.943335 -0.934339 0.80211
C  -3.47529 0.258596 1.51749
C  -4.206605 1.01057 -1.176591
C  2.714347 -1.071459 -0.37141
C  -4.688955 0.922238 1.244488
C  2.222941 0.137459 1.694025
C  -5.051633 1.293866 -0.083212
C  3.755049 -0.153736 -0.662133
C  3.259497 1.044564 1.399375
C  4.03686 0.914232 0.223249
C  5.552778 0.496733 -2.200284
H  1.093155 -2.511757 2.028079
H  0.712815 -2.645646 0.287339
H  -0.054149 -1.047885 -1.514871
H  -1.94606 0.088126 -2.767125
H  -3.1892 -0.02866 2.532319
H  -4.487049 1.296779 -2.196317
H  2.5411 -1.896191 -1.0726
H  -5.371165 1.159871 2.068199
H  1.627106 0.250905 2.606102
H  -6.003001 1.80852 -0.257923
H  3.472459 1.86854 2.089881
H  4.837148 1.630544 0.01564
H  6.347729 0.464308 -1.429818
H  5.203192 1.540216 -2.326878
H  5.947041 0.119811 -3.155532
