program: Gaussian 09
title: 000266609
version: EM64L-G09RevD.01
frameworkgroup: C1[X(C16H13NO)]
method: RPBEPBE
basis: SDD
operation: Freq
keyword: #p
keyword: freq=noraman
keyword: PBEPBE/SDD
title: #p freq=noraman PBEPBE/SDD
converged: YES YES NO NO
title: Mulliken charges:
elementType: O N C C C C C C C C C C C C C C C C H H H H H H H H H H H H H
charge: -0.220559 -0.410546 0.149768 0.194489 0.229494 -0.688521 0.115540 -0.339785 -0.383674 0.522692 -0.358318 -0.242947 -0.210977 -0.393926 -0.394203 -0.232647 -0.232567 -0.240542 0.232260 0.232557 0.266130 0.312846 0.289165 0.230990 0.225729 0.224817 0.226758 0.226790 0.222037 0.222035 0.225115
chargesum: 0.00000
title: Mulliken charges with hydrogens summed into heavy atoms:
elementType: O N C C C C C C C C C C C C C C C C
charge: -0.220559 -0.097700 0.149768 0.194489 0.229494 -0.223704 0.115540 -0.073655 -0.094510 0.522692 -0.127327 -0.017218 0.013841 -0.167168 -0.167414 -0.010610 -0.010532 -0.015427
polarizability: 2.63355438e+02 -1.01405072e+01 1.62928472e+02 -1.52459061e-01 1.26492393e-02 1.15835279e+02
1716.lowfreq: -18.9993 -8.0713 -5.4329 -0.0007 -0.0004 0.0006 2.0028 15.2532 49.1926
frequency: -18.5761 9.1975 49.1190 51.6543 117.8186 132.8802 199.4754 221.2273 251.6165 276.8486 314.5499 388.7867 402.7698 426.1758 472.4468 493.8847 521.9470 525.9306 567.0591 583.2633 586.4861 618.0871 629.0482 649.9580 699.3947 714.4333 758.4222 759.5547 771.4961 777.7577 817.1797 830.1811 848.4116 867.0574 867.0898 918.8284 925.5738 925.8867 949.8997 971.3035 989.7024 992.1061 992.3300 1009.9490 1027.9178 1080.1497 1088.3898 1124.8312 1144.3107 1159.5163 1166.9067 1171.9114 1187.8499 1214.7417 1240.9264 1250.6275 1271.5009 1298.2200 1326.3197 1351.5031 1385.2326 1391.9183 1421.0083 1441.0578 1446.4892 1450.1740 1483.9037 1486.7156 1527.1477 1578.8063 1591.9695 1597.0722 1619.2618 1631.8592 2974.9572 3029.4634 3115.1534 3115.9918 3127.9077 3130.4750 3140.4780 3143.3313 3159.6992 3160.9261 3185.1656 3226.8748 3597.9962
redmass: 3.8932 4.5851 5.0667 5.3101 5.3493 5.8506 6.1015 4.0225 5.5454 4.8591 2.0996 6.6395 2.7964 2.9285 3.7454 4.8166 3.3593 6.6187 2.3516 1.4795 5.7600 6.3071 6.2490 2.7700 2.3697 1.9069 1.3085 5.3791 4.2259 3.2827 1.4220 3.4416 1.2515 4.9368 1.4173 1.6818 3.4012 2.4843 1.3753 1.3922 2.5499 1.8961 1.3090 2.0979 2.1739 1.5956 2.4644 1.8065 1.4358 1.1307 1.1278 1.0507 1.1240 1.9187 1.7000 2.2434 2.1179 2.4585 1.2686 2.5605 8.4915 5.0677 2.5678 2.2020 1.1465 3.5707 2.9819 2.4518 4.5946 7.7933 7.1029 6.1444 6.2883 7.1278 1.0594 1.0995 1.0853 1.0882 1.0860 1.0913 1.0913 1.0961 1.0976 1.1016 1.0964 1.0979 1.0810
irintensity: 0.6245 0.6786 1.7915 0.8440 0.0005 2.7241 0.4254 9.0956 4.4989 0.5601 1.0085 0.7586 0.0146 11.7272 6.5736 3.0098 1.8967 12.6020 32.8012 64.1864 14.0270 0.5814 3.6676 4.1356 21.7768 72.8340 114.2011 3.6937 2.1125 6.5603 12.4584 24.7733 0.0692 1.8211 0.6687 37.3267 56.4613 13.6682 4.1706 0.1198 0.0950 0.1981 0.7217 14.0207 9.4673 10.0682 17.1940 122.8059 2.9157 1.4494 5.0608 0.2235 0.2564 1.4290 12.3421 14.8842 20.1613 35.4110 0.0964 6.0486 0.0020 113.0499 79.1457 6.6840 6.4690 26.0800 4.2343 16.4124 112.8940 141.9036 30.2927 1.0889 14.9272 1.4472 34.1486 8.6281 10.5681 4.1583 0.3983 16.2164 19.9860 48.2658 31.5651 24.0470 6.5663 0.0333 73.4940
temp: 298.150 k
press: 1.00000 atm
elementType: 8 7 6 6 6 6 6 6 6 6 6 6 6 6 6 6 6 6 1 1 1 1 1 1 1 1 1 1 1 1 1
symmnumber: 1
zpe: 640860.1 jmol-1
zpe.correction: 0.244091 hartree
zpe.thermalcorrener: 0.257713 hartree
zpe.thermalcorrenthalpy: 0.258658 hartree
zpe.thermalcorrgfe: 0.201375 hartree
zpe.sumelectzpe: -746.254246 hartree
zpe.sumelectthermal: -746.240623 hartree
zpe.sumelectthermalent: -746.239679 hartree
zpe.sumelectthermalfe: -746.296961 hartree
dipole: -2.7426 4.8688 0.0093
dipole: 5.5882
quadrupole: -87.7512 -93.6871 -103.2028
quadrupole: -9.1458 -0.0360 -0.0061
quadrupole: 7.1292 1.1932 -8.3225 -9.1458 -0.0360 -0.0061
hfenergy: -746.4983368 hartree
pointgroup: C01 [X(C16H13N1O1)]
dipole: 1.0650809 1.9231272 -0.0284384 debye
polarizability: 263.2022455|10.8647802|163.0734272|-0.4392602|-0.6060256|115.8435167 unknown
InChI: InChI=1S/C16H13NO/c18-16(10-12-6-2-1-3-7-12)14-11-17-15-9-5-4-8-13(14)15/h1-9,11,17H,10H2
charge 0 multiplicity 1
31 atoms
O  -0.530578 -1.201593 0.0245
N  2.824105 2.032432 -0.027301
C  2.296973 -0.193754 0.003925
C  1.059138 0.584334 -0.003013
C  3.386216 0.741145 -0.011677
C  -1.472326 1.079085 -0.004243
C  -0.311898 0.046898 0.007414
C  1.438432 1.939107 -0.022163
C  2.58118 -1.583713 0.02143
C  -2.857792 0.462915 0.001306
C  4.739112 0.34112 -0.010441
C  3.930142 -1.992702 0.022753
C  4.9959 -1.045389 0.007063
C  -3.51282 0.144689 -1.214452
C  -3.516894 0.174117 1.222178
C  -4.796973 -0.444136 -1.212886
C  -4.801087 -0.414659 1.230446
C  -5.44694 -0.724481 0.011257
H  -1.337528 1.718872 -0.898995
H  -1.338588 1.737986 0.876681
H  0.819478 2.834463 -0.032489
H  3.353937 2.902197 -0.040594
H  1.759003 -2.303334 0.033364
H  5.559098 1.067676 -0.022517
H  4.169691 -3.061727 0.036141
H  6.032299 -1.400827 0.008597
H  -3.011729 0.353298 -2.168106
H  -3.019069 0.405814 2.172197
H  -5.288581 -0.684459 -2.162532
H  -5.295911 -0.631963 2.183966
H  -6.443693 -1.18021 0.015093
