program: Gaussian 09
title: 000266589
version: EM64L-G09RevD.01
frameworkgroup: C1[X(C10H11NO2)]
method: RPBEPBE
basis: SDD
operation: Freq
keyword: #p
keyword: freq=noraman
keyword: PBEPBE/SDD
title: #p freq=noraman PBEPBE/SDD
converged: NO NO NO NO
title: Mulliken charges:
elementType: O O N C C C C C C C C C C H H H H H H H H H H H
charge: -0.436837 -0.432190 -0.493731 0.074423 0.184492 0.121872 0.229604 0.066070 0.162042 -0.865284 -0.801832 -0.367899 -0.337374 0.283886 0.232112 0.231960 0.244992 0.247248 0.247247 0.218418 0.243685 0.243719 0.367294 0.336083
chargesum: 0.00000
title: Mulliken charges with hydrogens summed into heavy atoms:
elementType: O O N C C C C C C C C C C
charge: -0.069543 -0.096107 -0.209845 0.074423 0.184492 0.121872 0.229604 0.066070 0.162042 -0.156220 -0.088919 -0.124214 -0.093654
polarizability: 1.66035192e+02 -5.58747191e+00 1.43490847e+02 1.14298266e-02 1.54322562e-02 5.91257637e+01
1716.lowfreq: -267.1287 -82.2146 -6.5870 -1.9794 -0.0007 -0.0005 -0.0003 7.9500 89.7281
frequency: -267.1258 -82.1396 89.6899 118.7350 140.4519 174.1214 193.2327 206.8006 251.6207 284.9316 292.3469 308.1610 358.5135 369.1496 436.9284 446.6366 528.1467 541.0340 546.7202 575.8259 593.5453 637.2636 675.4862 717.2035 732.9764 800.9210 802.8436 911.7581 964.9728 974.9528 1025.0530 1027.9573 1045.4579 1083.0990 1123.2197 1136.3847 1158.2313 1178.5170 1271.2963 1278.4443 1322.0921 1344.2430 1395.8272 1397.2036 1410.4108 1424.8890 1460.4026 1461.6138 1478.2915 1485.2978 1492.2050 1512.1829 1595.0002 1612.8791 1644.0295 2942.6637 2974.4874 3007.8127 3051.6638 3066.4411 3071.9191 3157.9014 3178.1816 3598.1987 3610.4999 3613.5385
redmass: 1.0900 1.0186 2.3683 3.2866 7.0480 1.1316 4.1276 1.2914 2.6198 3.9995 5.1446 4.2876 3.6664 5.0779 7.5824 1.1411 4.8305 5.9057 4.2650 4.2662 3.5680 4.4976 5.0297 7.2296 6.5539 3.7772 1.4058 1.3422 2.7934 1.5075 2.5305 1.3729 1.4895 1.7941 1.4665 1.8562 3.1064 1.7233 1.7584 2.0086 3.8243 2.9833 1.3290 3.3113 1.2693 4.1068 1.0443 3.8337 1.1286 1.0450 1.1073 4.0866 7.6226 7.0156 6.8526 1.0398 1.0372 1.0986 1.0983 1.0937 1.0977 1.0879 1.0962 1.0800 1.0666 1.0659
irintensity: 85.8669 0.0035 11.6304 0.1290 0.0357 20.5866 1.1281 87.5767 0.0979 17.4509 0.5554 0.6090 6.3323 1.8337 0.3993 151.5849 20.8957 0.4398 14.2865 0.0272 40.6341 0.0123 0.3101 1.1001 21.5641 4.0594 47.6150 0.0363 8.9845 19.3501 22.0668 5.5069 0.2317 0.8936 250.0939 28.6106 66.4784 48.6516 5.1920 25.2743 72.4519 67.5349 19.0657 27.3784 2.7449 17.8507 23.2997 28.0103 11.2321 4.0082 17.0444 118.6678 8.7040 2.6078 10.2055 47.2366 43.0533 23.7179 16.2921 21.1214 22.0238 7.3557 6.4044 32.2996 31.9496 28.6391
temp: 298.150 k
press: 1.00000 atm
elementType: 8 8 7 6 6 6 6 6 6 6 6 6 6 1 1 1 1 1 1 1 1 1 1 1
symmnumber: 1
zpe: 492338.1 jmol-1
zpe.correction: 0.187522 hartree
zpe.thermalcorrener: 0.199199 hartree
zpe.thermalcorrenthalpy: 0.200143 hartree
zpe.thermalcorrgfe: 0.150616 hartree
zpe.sumelectzpe: -591.918453 hartree
zpe.sumelectthermal: -591.906776 hartree
zpe.sumelectthermalent: -591.905832 hartree
zpe.sumelectthermalfe: -591.955360 hartree
dipole: 4.9898 -2.9833 0.0030
dipole: 5.8136
quadrupole: -73.5000 -67.2160 -81.0668
quadrupole: -1.0650 0.0015 0.0144
quadrupole: 0.4276 6.7116 -7.1392 -1.0650 0.0015 0.0144
hfenergy: -592.1059751 hartree
pointgroup: C01 [X(C10H11N1O2)]
dipole: 2.0333483 1.0473688 -0.001178 debye
dipolederiv: -0.1868399 0.3630615 -0.0007025 0.2010445 -1.3447691 -0.0004624 -0.0009136 0.000177 -0.3982685 -0.2001977 0.3376193 0.0000274 0.4775564 -1.2857323 -0.0001759 0.0000629 -0.0001323 -0.4078711 -0.5176068 0.1600785 0.0000625 -0.2154584 -0.6294703 0.0000505 0.0000431 0.0001152 -0.2808536 0.2329128 0.0146347 -0.0000055 0.0477485 -0.3499253 -0.0000573 -0.0000177 0.0000789 -0.0316947 -0.1210776 -0.1868011 -0.0000102 -0.156969 -0.0760764 -0.0000431 -0.0000915 0.0000355 -0.1348218 0.1844403 0.3533709 -0.0000169 0.380896 -0.0390194 -0.0000736 -0.0000105 -0.0000462 0.0205577 0.2499254 -0.1991035 -0.000035 0.0116623 0.5302441 0.0000643 0.00011 0.0001185 -0.0312327 0.1165074 -0.3857842 0.0001267 -0.2058207 1.1940236 0.0004 0.000152 0.0002404 0.0166497 0.1124209 -0.3467374 -0.0000554 -0.4262379 1.1459915 0.0001943 -0.0001097 0.0001544 0.0104309 -0.0254688 0.0107961 -0.0000154 -0.0178378 0.0655324 0.0001313 -0.0000635 0.000155 0.1141454 -0.0682512 -0.0272287 0.0000274 -0.0017494 0.0796828 -0.0000129 -0.0000863 -0.0000794 0.0764519 -0.0275593 0.2959009 0.0000417 -0.1177407 -0.1023471 0.0000302 -0.0000298 -0.000258 -0.1954814 -0.0491134 -0.1623285 -0.0000692 0.2115151 -0.0307124 -0.0000116 0.0000405 0.0000789 -0.1929598 0.1764714 0.0312195 0.0000125 0.0168361 0.1418907 -0.0000422 -0.0000049 -0.0001132 0.3236841 0.0823856 -0.0207565 0.0541944 0.0508373 -0.0630777 0.0964345 0.0179576 0.1301235 -0.049467 0.0823823 -0.0204595 -0.05407 0.0510458 -0.0630905 -0.0965199 -0.0177262 -0.130345 -0.0498977 -0.1474749 0.0061212 -0.0001486 -0.1071091 0.082915 -0.0001008 -0.0002209 -0.0000496 0.1059761 -0.0539519 -0.0284801 -0.0717926 0.0142084 0.0688077 0.0749392 -0.1310602 0.0281328 -0.0362325 -0.0539231 -0.0284061 0.0717785 0.0143174 0.0687851 -0.0749995 0.1310229 -0.0281974 -0.0361193 0.0716847 0.063301 -0.0000202 -0.0502994 -0.1617441 0.0000621 0.0000176 0.000073 0.1182066 0.0083723 -0.0896803 -0.0000165 -0.0930475 0.0000754 -0.000037 -0.0000331 -0.0000608 0.1733148 -0.0644379 0.05619 0.0000384 0.0495874 0.0877476 -0.0000205 0.0000467 -0.000006 0.1739882 0.1286315 -0.0360764 0.0006414 0.0005089 0.3625247 0.0002477 0.0009024 -0.0001893 0.3406767 0.069768 -0.1604514 0.0000071 -0.1354945 0.317744 0.0000024 0.0000121 -0.0000059 0.3708181 unknown
polarizability: 166.649763|4.1215351|142.8762761|-0.0104321|0.0161235|59.1257637 unknown
InChI: InChI=1S/C10H11NO2/c1-5-6(2)11-10-8(13)4-3-7(12)9(5)10/h3-4,11-13H,1-2H3
charge 0 multiplicity 1
24 atoms
O  -0.624915 -2.927611 -0.000767
O  -2.128115 2.566954 0.000201
N  0.86658 1.610336 -0.000264
C  0.09889 -0.537911 -0.000438
C  1.556798 -0.563627 -0.000488
C  -0.306859 0.840163 -0.000257
C  1.993342 0.763455 -0.000375
C  -0.910031 -1.545632 -0.00061
C  -1.671032 1.224576 -0.000029
C  2.450534 -1.782176 -0.00051
C  3.387825 1.330055 -0.000287
C  -2.263079 -1.165088 -0.000347
C  -2.638441 0.205898 -0.000029
H  0.92689 2.626433 0.000014
H  2.296421 -2.41603 0.897281
H  2.297769 -2.415126 -0.899195
H  3.517109 -1.496343 0.000411
H  3.960375 1.009619 0.890291
H  3.960638 1.009188 -0.890533
H  3.376258 2.435103 -0.000559
H  -3.028899 -1.94598 -0.000458
H  -3.695132 0.489399 0.000151
H  0.349281 -3.085056 -0.002926
H  -1.382106 3.212601 0.000224
