program: Gaussian 09
title: 000266588
version: EM64L-G09RevD.01
frameworkgroup: C1[X(C10H10O4)]
method: RPBEPBE
basis: SDD
operation: Freq
keyword: #pfreq=noraman
keyword: PBEPBE/SDD
title: #p freq=noraman PBEPBE/SDD
converged: YES YES NO NO
title: Mulliken charges:
elementType: O O O O C C C C C C C C C C H H H H H H H H H H
charge: -0.265497 -0.263761 -0.260067 -0.243983 0.497885 0.211141 0.167313 -0.473337 -0.640634 -0.423837 -0.327230 -0.203535 0.279384 -0.506131 0.284795 0.244054 0.241537 0.236603 0.250950 0.232346 0.240500 0.244953 0.233649 0.242901
chargesum: 0.00000
title: Mulliken charges with hydrogens summed into heavy atoms:
elementType: O O O O C C C C C C C C C C
charge: -0.265497 -0.263761 -0.260067 -0.243983 0.497885 0.211141 0.167313 -0.188542 -0.155042 -0.187234 -0.076280 0.269310 0.279384 0.215373
polarizability: 1.60993887e+02 1.06752379e+01 1.16125344e+02 -9.77638900e+00 4.98017907e+00 7.77741611e+01
1716.lowfreq: -12.3441 -6.9139 -5.0780 -0.0010 -0.0009 -0.0008 16.8738 25.0072 64.4965
frequency: 16.3561 24.8291 64.4918 84.4665 109.9898 143.4094 192.6341 219.4985 237.5068 275.4923 326.1071 380.5899 415.7252 422.3866 468.3715 563.5731 590.6177 618.4090 676.9537 700.0845 715.2735 761.1678 779.8755 793.8187 827.8916 840.4900 888.4012 911.5636 928.9083 936.8167 970.4534 980.9628 1059.1430 1070.5834 1104.4790 1112.2361 1125.8557 1130.2146 1148.6170 1180.3233 1230.2157 1246.5508 1267.5511 1303.4597 1363.8461 1402.9073 1421.1640 1439.5215 1451.0462 1452.8161 1463.2379 1474.5154 1485.2050 1611.8621 1629.5126 1641.4682 2999.0328 3006.4998 3009.2642 3099.3394 3105.9326 3109.5173 3144.7365 3151.6234 3173.6592 3182.0354
redmass: 4.7238 5.2612 3.7420 3.0150 1.0975 5.1951 5.1278 5.5822 5.1725 3.4509 6.7795 3.4081 3.1067 3.5016 5.6185 5.7972 5.1577 4.8841 9.0613 6.3657 4.7182 5.2148 5.0770 2.0293 2.4701 6.4214 1.6382 3.1863 1.4788 2.4780 5.3742 4.1453 3.6721 1.4919 1.8592 1.2885 1.1686 1.3265 1.4373 1.6388 1.6609 4.9861 1.3115 1.7904 1.2656 3.5791 1.2067 3.6552 1.2122 1.0507 1.0544 2.0285 1.3240 7.7730 8.4908 8.9258 1.0605 1.0294 1.0633 1.0982 1.1107 1.1047 1.0898 1.1049 1.0935 1.0959
irintensity: 1.7906 0.7164 7.0404 10.1845 0.5847 1.9403 5.9319 1.4521 2.7235 13.0496 1.8666 9.9831 2.9746 5.7285 8.2585 2.0490 9.7753 7.9199 1.1065 3.2367 1.6903 16.2168 19.0879 47.1683 13.7469 27.3762 21.7768 3.2507 3.0648 3.9038 108.4564 59.7335 19.9908 5.1837 173.5699 7.3302 4.4404 12.0393 6.9655 27.2328 136.0072 184.2463 7.3455 44.6246 0.7769 19.3791 22.2446 30.5565 64.1697 11.6284 18.0817 98.1982 32.0331 4.1876 16.7360 142.9224 123.9200 31.5363 13.1969 5.7968 32.1810 26.1858 9.0266 15.7700 0.2887 5.1559
temp: 298.150 k
press: 1.00000 atm
elementType: 8 8 8 8 6 6 6 6 6 6 6 6 6 6 1 1 1 1 1 1 1 1 1 1
symmnumber: 1
zpe: 476503.0 jmol-1
zpe.correction: 0.181490 hartree
zpe.thermalcorrener: 0.194490 hartree
zpe.thermalcorrenthalpy: 0.195434 hartree
zpe.thermalcorrgfe: 0.139233 hartree
zpe.sumelectzpe: -686.901668 hartree
zpe.sumelectthermal: -686.888669 hartree
zpe.sumelectthermalent: -686.887724 hartree
zpe.sumelectthermalfe: -686.943926 hartree
dipole: 0.6624 1.1950 1.0775
dipole: 1.7400
quadrupole: -66.7300 -83.2051 -77.9999
quadrupole: 6.3609 1.4690 -3.3728
quadrupole: 9.2483 -7.2267 -2.0216 6.3609 1.4690 -3.3728
hfenergy: -687.0831588 hartree
pointgroup: C01 [X(C10H10O4)]
dipole: -0.2941818 0.5249355 -0.3264243 debye
dipolederiv: -1.0795514 0.3433559 0.2963703 0.4730095 -0.6464298 -0.1329565 0.2667399 -0.0833352 -0.3666136 -1.2598142 0.2651023 0.3366098 0.2488516 -0.5120863 -0.0991067 0.3321311 -0.0931087 -0.3760359 -1.0920542 0.168442 -0.4164738 0.295533 -0.5548879 0.1554217 -0.6316544 0.0764811 -0.6097694 -0.6116881 -0.0785843 -0.1248951 0.1152146 -0.8846451 0.1310641 -0.1951511 -0.1164483 -0.4002567 0.3183438 0.0274146 -0.0332493 0.0750663 -0.0062458 -0.08745 -0.2223101 -0.0514496 -0.0716589 0.4841104 -0.3439439 -0.1065306 -0.8948706 0.5246114 0.2702097 -0.0548668 0.0864969 0.0546008 1.0586854 -0.2631328 -0.3263525 0.1983348 -0.1224852 -0.0807569 -0.3605359 0.0897114 0.1458766 -0.1721691 0.1143536 -0.0312279 0.0353708 -0.0099272 -0.0087713 0.0109714 -0.0289035 -0.1484656 -0.2499241 -0.136714 -0.1344124 -0.1535065 0.0138518 -0.0336291 -0.0807832 -0.0559883 0.0240138 -0.16782 0.0253901 -0.0379525 -0.0793016 0.0016074 0.0251365 -0.0133455 -0.0417377 -0.1681835 -0.0910594 -0.0161373 -0.0411858 0.0935717 0.0717647 -0.0466268 -0.0195219 -0.001954 -0.129123 0.969952 -0.1939702 -0.2002151 -0.2449074 0.6451047 0.1213144 -0.2532103 0.1269751 0.7094142 1.2400358 -0.0880963 0.5726642 -0.3455983 1.1483462 -0.2686452 0.8715394 0.0613976 0.5852892 0.5084273 0.0086651 0.1221387 0.1080881 0.2229104 0.0419843 0.19284 -0.0078048 0.3947094 0.1460623 -0.0400888 0.0377189 -0.0338257 0.0263799 0.0195828 0.0273855 0.0099405 0.1531464 0.0236529 -0.0066209 0.0032439 -0.0480722 0.0410336 0.0981919 0.0410631 0.0486146 -0.0466168 0.0419113 0.025239 0.016537 0.0741655 -0.058406 -0.0519723 -0.0099628 -0.0079492 0.097159 0.0204192 0.1092762 0.0505445 0.0891485 -0.0135974 -0.0151016 0.040179 -0.0242613 0.1390422 0.0700577 -0.0599775 0.0393061 -0.059862 -0.0180457 0.0338169 0.05136 0.0374675 0.1598624 0.0176676 0.0084388 -0.0103828 0.0449799 0.0214825 -0.0508989 0.1335604 -0.1021196 -0.1922873 -0.1399248 0.0792552 -0.0174968 0.0721687 0.049005 -0.003391 -0.0743642 0.0207913 0.031583 -0.0259305 0.043605 0.0813335 -0.0205957 0.0644651 -0.1043469 -0.0023881 -0.0499818 -0.0520115 0.0006361 0.0667868 -0.0731763 0.1125253 -0.0102053 0.0605363 -0.0813048 0.029801 0.0707734 -0.0100262 -0.0580586 -0.0029159 -0.1554885 0.0063989 0.0263946 0.0316292 0.077365 -0.0044483 unknown
polarizability: 160.3300058|-7.2792253|116.1344551|-15.2785216|1.5440703|78.4289313 unknown
InChI: InChI=1S/C10H10O4/c1-12-10(11)5-7-2-3-8-9(4-7)14-6-13-8/h2-4H,5-6H2,1H3
charge 0 multiplicity 1
24 atoms
O  2.596419 -1.599281 -0.131528
O  3.497283 0.567178 -0.633341
O  -3.688759 0.302146 -0.152612
O  -2.708951 -1.757268 0.319492
C  -0.435885 0.414974 0.841685
C  1.629193 -0.592765 0.124995
C  2.160477 0.681936 -0.171621
C  0.342879 -0.763904 0.634344
C  -1.85288 0.29805 1.405527
C  0.100965 1.689667 0.537778
C  1.419842 1.847601 0.025777
C  3.72317 -0.894267 -0.796239
C  -2.763603 -0.518498 0.495106
C  -4.603448 -0.386362 -1.098975
H  -0.063656 -1.755892 0.849316
H  -1.827127 -0.220754 2.382268
H  -2.291254 1.297122 1.551801
H  -0.514418 2.581779 0.696623
H  1.833551 2.833191 -0.20107
H  3.71712 -1.141177 -1.874794
H  4.664305 -1.169309 -0.295643
H  -4.0239 -0.858259 -1.909874
H  -5.255545 0.408596 -1.486209
H  -5.185478 -1.160705 -0.5718
