program: Gaussian 09
title: 000266576
version: EM64L-G09RevD.01
frameworkgroup: C1[X(C9H13NO2S)]
method: RPBEPBE
basis: SDD
operation: Freq
keyword: #p
keyword: freq=noraman
keyword: PBEPBE/SDD
title: #p freq=noraman PBEPBE/SDD
converged: YES YES NO NO
title: Mulliken charges:
elementType: S O O N C C C C C C C C C H H H H H H H H H H H H H
charge: 0.959287 -0.548355 -0.528708 -0.529524 0.175072 0.357816 -0.441284 0.470465 -0.382168 -0.412530 -0.841712 -0.736833 -0.803882 0.245698 0.294214 0.232682 0.233675 0.262047 0.229289 0.239001 0.283877 0.277586 0.271306 0.226263 0.244680 0.222036
chargesum: 0.00000
title: Mulliken charges with hydrogens summed into heavy atoms:
elementType: S O O N C C C C C C C C C
charge: 0.959287 -0.548355 -0.528708 -0.235310 0.175072 0.357816 -0.195586 0.470465 -0.149486 -0.178855 -0.111374 0.095936 -0.110902
polarizability: 2.22370017e+02 2.55538741e+00 1.50352550e+02 -7.50004815e+00 -2.53686309e+00 9.23574316e+01
1716.lowfreq: -14.1429 -9.6499 -4.8825 -0.0023 -0.0018 -0.0009 6.1744 29.5214 38.9593
frequency: -4.6303 29.5035 38.9161 64.3087 118.7883 142.9622 153.1952 160.1944 164.9606 169.4826 244.9635 273.9892 292.5365 309.1242 334.6477 341.8789 384.2208 433.8601 462.1903 479.1077 554.0725 575.3106 607.3326 714.4388 727.2206 749.2716 802.5456 825.7855 876.2650 894.5389 911.6270 932.3565 959.4702 976.6141 995.3768 1010.1181 1022.3501 1044.5871 1049.4860 1125.1335 1164.1365 1189.9661 1241.5869 1260.3041 1295.2993 1308.4019 1373.8203 1398.0630 1400.6117 1413.0771 1415.4219 1421.2818 1467.8907 1473.4703 1475.9357 1482.0725 1492.8783 1570.1278 1620.4514 2964.7783 2979.4027 3036.7288 3039.0050 3061.2424 3086.9861 3089.0516 3120.8273 3143.0251 3148.2537 3183.5767 3193.7089 3325.1505
redmass: 5.2850 1.0337 4.3755 5.6061 3.0302 2.0253 2.0715 2.3609 1.1727 3.9776 4.0011 3.4864 3.3388 4.2131 4.5533 4.3355 7.2637 3.8710 2.9554 3.2713 5.0372 5.2811 5.3714 4.1765 3.2289 4.6715 11.7063 1.2913 2.3677 1.5014 1.6039 2.0274 1.3618 1.2976 1.8038 1.3956 1.8194 1.5506 1.5547 2.3427 1.6811 1.4480 2.0529 2.7561 1.3672 1.1427 4.1027 1.2337 1.2859 1.0662 1.1038 2.4560 1.1085 1.0597 1.0482 1.1316 2.9037 5.0755 6.4600 1.0401 1.0378 1.0248 1.0966 1.0963 1.0996 1.0967 1.0873 1.0950 1.0937 1.1073 1.1073 1.0735
irintensity: 5.6061 0.7761 0.8866 3.3306 3.5330 7.5713 2.3425 9.1715 1.9195 8.9480 4.0709 5.5378 1.3313 16.0415 9.3353 28.6491 28.4878 5.6824 9.4250 6.3012 23.7526 29.3094 14.0460 0.1349 3.3806 2.0782 55.9798 32.8438 80.8722 12.3597 19.0557 4.5261 0.0924 38.7271 0.0699 7.2419 34.7932 2.5662 18.0974 2.6634 5.4033 1.3665 1.1566 9.3508 8.3102 4.1861 1.1637 18.4606 8.6665 11.5224 15.6338 6.3832 7.0057 9.1431 19.6156 22.3909 33.8342 9.8523 2.8250 21.8079 32.0338 0.3344 13.0122 20.2436 16.4272 17.4051 10.5875 31.5796 5.4194 0.5204 0.6676 13.1949
temp: 298.150 k
press: 1.00000 atm
elementType: 16 8 8 7 6 6 6 6 6 6 6 6 6 1 1 1 1 1 1 1 1 1 1 1 1 1
symmnumber: 1
zpe: 531077.7 jmol-1
zpe.correction: 0.202277 hartree
zpe.thermalcorrener: 0.216750 hartree
zpe.thermalcorrenthalpy: 0.217694 hartree
zpe.thermalcorrgfe: 0.160009 hartree
zpe.sumelectzpe: -952.864268 hartree
zpe.sumelectthermal: -952.849795 hartree
zpe.sumelectthermalent: -952.848851 hartree
zpe.sumelectthermalfe: -952.906537 hartree
dipole: 1.6205 -0.5273 3.3725
dipole: 3.7786
quadrupole: -77.7076 -77.2344 -92.2673
quadrupole: 6.8458 -12.0386 -2.0460
quadrupole: 4.6955 5.1687 -9.8643 6.8458 -12.0386 -2.0460
hfenergy: -953.0665452 hartree
pointgroup: C01 [X(C9H13N1O2S1)]
dipole: -0.573793 0.236548 -1.3508651 debye
dipolederiv: 1.3456415 -0.0717997 0.0219383 -0.4299841 1.2067597 -0.0449324 -0.0617617 0.0485662 1.144268 -1.046744 0.0350142 -0.1355129 -0.1164719 -0.5388528 -0.1184036 -0.3286596 0.0087781 -0.5785626 -0.4938192 0.0042287 0.063954 0.315819 -0.6544104 0.1417352 -0.1208956 0.0647633 -0.4968626 0.3531102 -0.1794928 0.1081662 0.1440266 -0.2819235 0.1136129 0.471993 0.0082583 -0.3931686 -0.0818076 0.11906 -0.065527 -0.0616644 -0.0307281 0.0249775 0.0565858 0.0085634 -0.0054302 0.0341673 0.2028228 0.0935172 -0.0566511 0.2158376 0.0359064 -0.1664848 0.0698537 -0.0275343 0.0751908 -0.2013432 -0.1297308 0.0760381 -0.146661 0.030133 0.0635297 0.0135645 -0.058834 -0.0861227 0.2646232 0.0910439 0.3750682 0.2737645 0.085285 0.1787931 -0.0314338 -0.0349275 -0.1190381 -0.1746415 -0.1275197 -0.1914055 -0.0494897 0.0474072 -0.0891874 0.0933228 -0.0764621 0.0264131 0.05205 -0.0845439 -0.0767178 -0.0615788 0.0466741 -0.116273 0.039385 -0.0916043 -0.011595 -0.1301306 -0.061794 -0.0536721 -0.0662048 -0.0490154 -0.0535338 -0.0398168 0.0408262 -0.1945334 0.0135249 0.0533204 0.1175276 -0.1016573 -0.0395137 -0.0034052 -0.0425382 -0.1491964 0.0727557 -0.034231 -0.0131936 -0.1156285 -0.141028 -0.0498762 0.0140739 0.0114242 0.0696578 0.0588329 0.0522337 0.0624569 0.0433694 0.0168989 -0.0696531 0.0280389 -0.0601005 0.0613457 0.0654168 0.0154489 -0.0676531 -0.0631786 0.0614865 -0.0382187 -0.159856 -0.0401353 0.1973165 0.0315525 0.0520581 0.0509484 0.0752212 -0.0258044 -0.1062535 0.0916097 -0.1052725 0.07549 -0.1141733 -0.0408863 0.0568404 -0.0511621 0.0920941 -0.014874 0.0485222 -0.0103231 0.1233123 -0.0274121 -0.0155968 -0.0969142 0.0442611 0.0437091 0.0366382 -0.0662531 0.0061247 0.0611419 0.0734849 -0.0961988 0.0476814 -0.0516412 -0.0225568 0.0381522 0.049058 0.1105757 -0.0492457 0.0036038 0.1309543 0.1089711 0.0348214 0.0242418 -0.060278 0.0679253 -0.1017267 0.0404571 -0.004324 0.0662565 -0.0165388 0.0811738 0.0708595 0.019113 0.0408294 0.0112284 0.0461266 0.0030102 -0.0316629 -0.01892 -0.0282826 0.0656201 -0.0544258 0.001562 -0.059044 0.0374171 0.0683768 -0.0165866 0.051998 -0.010008 -0.0037281 0.0296335 0.0615056 0.0244123 0.0459292 0.0641804 0.0010909 0.0844618 -0.0279682 0.054691 -0.0535583 -0.003628 -0.105654 -0.1014898 0.0684826 0.0175347 -0.0603736 -0.0379842 -0.0752901 0.0647794 -0.0323563 0.1029513 0.020444 -0.1646503 -0.0343303 -0.0170762 0.0650938 0.0739507 -0.0150449 0.0282682 -0.0257268 0.0995857 unknown
polarizability: 222.8462462|-0.9332017|142.625596|-2.06328|19.8505775|99.6081563 unknown
InChI: InChI=1S/C9H13NO2S/c1-7-4-5-8(2)9(6-7)10-13(3,11)12/h4-6,10H,1-3H3
charge 0 multiplicity 1
26 atoms
S  2.38684 -0.152339 0.332157
O  3.272461 0.893823 1.228845
O  1.624186 -1.416393 1.020126
N  1.045376 0.860697 -0.850656
C  -0.295994 0.710643 -0.403181
C  -0.962281 1.716575 0.377087
C  -0.976573 -0.479448 -0.778109
C  -2.323817 -0.703118 -0.420231
C  -2.318812 1.497743 0.69794
C  -2.990082 0.31321 0.312431
C  -0.231319 2.962059 0.845274
C  3.510383 -0.829722 -1.046342
C  -3.026144 -1.997008 -0.790656
H  -0.427249 -1.223896 -1.364753
H  1.397856 1.82613 -0.679457
H  -2.858441 2.257847 1.275045
H  -4.041135 0.173996 0.592537
H  0.667966 2.708921 1.439227
H  0.097177 3.600447 0.000696
H  -0.88585 3.580848 1.4809
H  4.28469 -1.420096 -0.536786
H  2.866205 -1.439672 -1.692047
H  3.923744 0.04101 -1.572071
H  -2.750552 -2.333609 -1.805995
H  -2.747712 -2.808105 -0.090761
H  -4.123824 -1.887842 -0.752719
