program: Gaussian 09
title: 000266562
version: EM64L-G09RevD.01
frameworkgroup: C1[X(C13H5NO7)]
method: RPBEPBE
basis: SDD
operation: Freq
keyword: #p
keyword: freq=noraman
keyword: PBEPBE/SDD
title: #p freq=noraman PBEPBE/SDD
converged: YES YES NO YES
title: Mulliken charges:
elementType: O O O O O O O N C C C C C C C C C C C C C H H H H H
charge: -0.214678 -0.164747 -0.164856 -0.411139 -0.217127 -0.162314 -0.188127 0.020620 0.241013 0.238945 0.085932 0.079232 0.208211 0.270736 -0.372671 -0.376892 -0.361859 -0.391110 0.113581 0.114764 0.090270 0.290308 0.293268 0.287623 0.292807 0.398209
chargesum: 0.00000
title: Mulliken charges with hydrogens summed into heavy atoms:
elementType: O O O O O O O N C C C C C C C C C C C C C
charge: -0.214678 -0.164747 -0.164856 -0.012930 -0.217127 -0.162314 -0.188127 0.020620 0.241013 0.238945 0.085932 0.079232 0.208211 0.270736 -0.082363 -0.083624 -0.074235 -0.098303 0.113581 0.114764 0.090270
polarizability: 2.51685426e+02 1.30704210e+00 2.20924850e+02 -5.35513185e-01 -1.33374931e+01 7.61689291e+01
1716.lowfreq: -5.7888 -4.6756 -4.1544 -0.0005 -0.0003 0.0002 38.7852 62.4954 73.8310
frequency: 38.7786 62.4940 73.8307 76.7865 101.2232 129.3390 161.2197 186.2118 204.2245 224.6664 256.0289 258.4402 295.3272 317.5111 349.7946 368.9596 411.0137 439.2090 454.7525 470.4681 478.5047 529.0697 560.2875 581.5114 582.3940 615.1876 623.0000 637.7033 668.0110 676.3312 709.4184 724.1314 732.0649 743.4271 759.9315 791.7909 795.4784 878.0890 887.9101 893.8295 939.2199 961.0210 998.5739 1004.5226 1039.7244 1082.8919 1116.5361 1156.8657 1163.4088 1203.1750 1212.1428 1227.2438 1256.0277 1324.5933 1340.7543 1379.6982 1390.5378 1405.6817 1425.0274 1455.0278 1521.4656 1572.4593 1589.5270 1606.5531 1634.4038 1649.0070 1685.9816 3166.5301 3169.1875 3186.0373 3186.1385 3524.8935
redmass: 11.7326 12.5102 7.5335 9.4914 11.3055 14.1598 7.9816 13.3154 5.8306 9.3752 7.6709 9.0865 11.3517 8.6617 7.6624 11.8267 9.3052 5.9543 4.0197 6.4278 9.4043 6.4082 3.1119 4.0761 7.2030 2.5894 5.7510 4.2497 7.2906 7.3575 5.5456 7.2542 5.7453 6.8638 10.3453 8.9962 6.1000 8.2689 1.4775 1.4289 9.1271 8.1211 1.3999 1.4139 4.2110 4.2590 1.9851 2.5261 1.9825 1.6246 6.3745 2.8322 2.4679 2.2429 3.2584 12.0862 5.9713 5.7373 6.5710 2.9534 5.4795 6.3628 7.6401 9.5309 9.4219 12.7241 12.7421 1.0906 1.0903 1.0963 1.0959 1.0643
irintensity: 0.8803 3.8771 0.6498 4.5737 3.3625 0.2112 7.0339 0.8234 6.9496 3.4009 1.3610 0.7504 1.3001 3.5449 3.2835 15.1852 10.2341 3.1206 0.4884 2.0726 1.5931 25.7341 16.9711 12.8129 13.5893 77.8717 20.2720 15.4775 1.7595 21.0880 15.8006 13.5228 31.2146 28.9327 21.8986 1.1608 3.2835 23.5269 28.1424 35.0358 377.9739 24.4081 1.1882 6.7558 314.7031 32.3022 101.8119 30.3899 5.0319 9.3334 147.3347 53.9119 96.3645 114.9623 2.3384 131.7070 25.9342 27.1190 1.1934 13.8128 33.9252 8.6604 62.7893 6.2536 202.1453 256.2295 293.4645 0.1752 0.6347 2.7056 0.0395 75.0101
temp: 298.150 k
press: 1.00000 atm
elementType: 8 8 8 8 8 8 8 7 6 6 6 6 6 6 6 6 6 6 6 6 6 1 1 1 1 1
symmnumber: 1
zpe: 420626.2 jmol-1
zpe.correction: 0.160208 hartree
zpe.thermalcorrener: 0.176438 hartree
zpe.thermalcorrenthalpy: 0.177382 hartree
zpe.thermalcorrgfe: 0.115974 hartree
zpe.sumelectzpe: -1078.203798 hartree
zpe.sumelectthermal: -1078.187568 hartree
zpe.sumelectthermalent: -1078.186624 hartree
zpe.sumelectthermalfe: -1078.248032 hartree
dipole: -2.8784 1.8059 0.0145
dipole: 3.3981
quadrupole: -153.6791 -107.2556 -120.8542
quadrupole: -13.4963 -0.4480 3.0600
quadrupole: -26.4161 20.0074 6.4088 -13.4963 -0.4480 3.0600
hfenergy: -1078.3640056 hartree
pointgroup: C01 [X(C13H5N1O7)]
dipole: 1.1321797 -0.7047434 -0.0937934 debye
dipolederiv: -0.5709922 0.0161177 0.0159822 0.02246 -1.5875745 -0.1852169 0.016285 -0.213726 -0.2596965 -0.8661088 0.305996 0.0837719 0.3984811 -0.8553869 -0.1023304 0.0956317 -0.1092061 -0.3273242 -0.8516007 -0.3193017 -0.0417298 -0.4252622 -0.8948887 -0.0774611 -0.0538111 -0.088767 -0.3165037 -0.7049636 0.4543477 0.2619479 0.5008653 -0.8569832 -0.2462502 0.3271837 -0.2449216 -0.4867739 -0.8063981 0.0003787 -0.2362112 0.1020804 -0.5554032 -0.2026933 -0.0810165 -0.1466871 -0.5952205 -0.592153 -0.2907431 -0.0259628 -0.2748978 -0.5524462 -0.1928652 0.05517 -0.1476454 -0.3306646 -0.6186535 -0.0063881 0.1801937 -0.0403071 -0.4704179 -0.1798442 0.0990585 -0.1760255 -0.4885751 1.4140605 0.3981373 -0.2364379 0.3519333 0.755403 0.4198572 -0.2146811 0.350279 0.6679918 -0.0903363 0.0613779 0.0091699 0.0021595 -0.0091896 0.0067044 0.0175457 0.012299 0.0098618 -0.221247 -0.0597735 0.0061047 0.0371341 0.074465 -0.0674502 0.0466786 -0.017899 0.001992 -0.6365406 0.0279002 -0.0110189 0.1790756 -0.0299976 -0.007906 0.0351599 -0.0040476 0.0207473 -0.5716278 -0.0603924 0.0522422 -0.1592334 0.016533 0.0020888 0.0157534 0.0013034 0.0257139 -0.2799304 0.076744 -0.0125152 -0.0075496 0.082836 -0.0021264 -0.0422819 -0.0298487 0.00297 -0.2752228 -0.099735 0.0418837 -0.008448 0.2341792 -0.0346992 0.0450496 -0.0200031 0.0207121 0.1642421 0.2810598 0.0439047 -0.0467887 -0.0114797 0.0199301 0.0069381 0.0329265 -0.0666092 0.0997705 -0.2906516 -0.0493551 0.0196605 -0.0387833 0.0165163 -0.0295543 0.0499576 -0.064795 -0.0622157 -0.2835061 -0.0559566 -0.1091663 -0.0548241 0.0000715 0.0039855 0.012198 -0.0854799 -0.0255026 0.2840652 0.0408814 0.0331728 -0.1276004 0.001923 -0.0666932 -0.0291775 -0.0766369 1.6534436 -0.0584169 -0.0157652 0.2111596 1.6065735 0.1873322 -0.0076097 0.2088844 0.3310884 1.6229426 0.0861206 -0.0864535 -0.1737784 1.5946648 0.1959844 -0.0962 0.2049276 0.3372976 1.6230169 -0.4462124 0.1249457 -0.5298339 1.0354753 0.5117204 -0.041676 0.4155687 0.768946 0.0818123 -0.0579324 -0.0123294 -0.0288201 0.0673836 -0.0126976 -0.002139 -0.0070245 0.15175 0.081579 0.0517333 0.0162814 0.0224244 0.0768866 -0.0114774 0.0098024 -0.0092706 0.1512817 0.0874223 0.0424531 0.0024862 0.0503415 0.0475247 -0.0019611 -0.0241055 -0.0123469 0.1473553 0.0889929 -0.0476426 0.0001551 -0.0282982 0.0844681 0.0069121 0.038416 -0.006669 0.1547705 0.2562102 -0.0657357 -0.0962151 -0.0985644 0.3685824 -0.0440609 -0.1528896 -0.0250785 0.3058012 unknown
polarizability: 251.4731699|2.3068003|217.8843863|-5.940651|24.631603|79.4216485 unknown
InChI: InChI=1S/C13H5NO7/c15-11(16)5-1-2-6-9-7(13(18)21-12(6)17)3-4-8(10(5)9)14(19)20/h1-4,15H
charge 0 multiplicity 1
26 atoms
O  -3.708022 -0.053285 0.101426
O  -3.779226 2.205583 0.48045
O  -3.692667 -2.313959 -0.27629
O  3.384987 -2.3723 -0.487853
O  3.371362 -0.636113 1.056783
O  3.272256 2.557276 0.123932
O  3.130127 0.827905 -1.35737
N  2.645932 1.581533 -0.426782
C  -0.830035 0.020543 -0.009252
C  0.617069 0.051395 -0.065226
C  -1.525978 -1.225701 -0.162059
C  -1.57594 1.229151 0.198363
C  1.318707 -1.209264 -0.13311
C  1.223562 1.356931 -0.041567
C  -0.813459 -2.414736 -0.361152
C  -0.917948 2.458092 0.341543
C  0.603639 -2.403194 -0.320385
C  0.489145 2.523229 0.196625
C  -3.011721 -1.288278 -0.125731
C  -3.063057 1.213201 0.275931
C  2.776619 -1.323355 0.195457
H  -1.366106 -3.348328 -0.502073
H  -1.508351 3.361516 0.519447
H  1.161739 -3.339536 -0.398129
H  1.015861 3.480504 0.229806
H  4.340905 -2.432311 -0.217083
