program: Gaussian 09
title: 000266551
version: EM64L-G09RevD.01
frameworkgroup: C1[X(C14H21N5OS2)]
method: RPBEPBE
basis: SDD
operation: Freq
keyword: #p
keyword: freq=noraman
keyword: PBEPBE/SDD
title: #p freq=noraman PBEPBE/SDD
converged: YES YES NO NO
title: Mulliken charges:
elementType: S S O N N N N N C C C C C C C C C C C C C C H H H H H H H H H H H H H H H H H H H H H
charge: 0.162071 0.177718 -0.250207 -0.162963 -0.088010 -0.064569 -0.061279 -0.608517 -0.545616 0.042188 -0.451878 -0.032065 -0.695601 0.164012 -0.200408 -0.565829 -0.100066 -0.599798 -0.657986 0.168652 -0.372382 -0.652691 0.343930 0.245169 0.254111 0.260256 0.208493 0.255860 0.275629 0.269407 0.255421 0.251587 0.249602 0.247620 0.228528 0.229612 0.221432 0.241726 0.229002 0.230564 0.217479 0.333553 0.346244
chargesum: 0.00000
title: Mulliken charges with hydrogens summed into heavy atoms:
elementType: S S O N N N N N C C C C C C C C C C C C C C
charge: 0.162071 0.177718 -0.250207 -0.162963 -0.088010 -0.064569 -0.061279 0.071280 -0.201687 0.287357 0.062490 0.176428 -0.164112 0.164012 0.068999 -0.058821 -0.100066 -0.102575 0.021585 0.168652 -0.130656 0.024354
polarizability: 2.61934201e+02 1.86517874e+01 2.11340393e+02 5.49891126e+00 -1.86390432e+01 2.05399749e+02
1716.lowfreq: -16.3747 -9.3431 -5.2290 -0.0023 -0.0015 0.0006 4.9535 11.5022 19.1137
frequency: -15.8885 11.2772 19.1016 29.3152 34.9166 38.5581 44.6070 53.8215 71.2650 108.6636 142.4997 145.5714 154.4218 169.4548 177.4494 210.7835 215.7286 234.9783 239.4313 266.0906 279.7579 290.9698 328.6600 361.4797 373.6372 425.4779 445.4070 504.7972 513.2286 518.8229 522.1860 550.9434 568.3241 581.3363 626.0194 629.7647 647.3723 671.3057 688.6666 700.5111 707.7884 744.7562 761.8088 785.2480 790.4078 794.3132 809.4713 828.4155 855.6066 908.9830 913.3495 928.3642 950.0403 954.6276 976.4567 996.8453 997.6417 1025.6161 1028.6426 1032.4743 1036.8785 1057.2171 1067.4116 1078.9863 1114.3765 1134.5337 1164.2319 1180.0498 1196.0095 1218.1934 1224.9889 1236.5792 1239.1066 1240.2278 1255.5695 1266.6554 1271.2270 1282.4340 1289.9724 1301.2382 1312.4126 1319.8125 1325.8210 1346.5669 1355.0998 1380.2245 1393.6782 1396.7172 1401.3255 1428.4489 1442.0625 1456.8180 1458.9596 1459.9995 1462.6742 1469.2264 1471.2529 1483.9218 1483.9852 1539.5068 1580.2911 1633.4881 2983.7872 2984.3415 2985.3455 3005.6394 3012.9589 3015.2181 3021.9690 3034.8846 3049.8589 3066.8432 3073.6031 3078.5679 3079.6218 3092.1668 3096.9343 3100.8610 3105.3983 3159.8462 3228.1812 3539.1019 3694.0166
redmass: 3.5016 6.6586 6.5947 3.7441 3.3302 2.2927 2.5911 2.9001 5.5871 5.3033 4.2182 4.4752 4.6505 4.5748 6.6105 4.3929 6.1389 1.0960 1.1063 3.7768 4.9645 3.6407 3.9487 3.7520 5.4563 3.2370 3.5706 5.9892 4.7849 4.2655 1.2623 1.0445 4.1492 4.9613 4.4181 4.3023 4.6319 8.0530 7.6518 6.8643 5.4442 5.2490 3.4039 1.1261 1.1267 4.5994 3.6658 1.8105 8.2075 2.0514 2.9712 1.4314 2.5017 3.2569 2.6901 1.8000 1.8187 3.4704 1.2207 1.2324 2.8979 3.1857 2.2680 2.8107 2.2384 2.1420 1.3134 1.8992 1.9094 1.2795 2.0796 1.5119 1.2872 1.2464 1.4665 1.8044 1.5034 1.2674 1.2767 4.2933 1.4669 3.2633 1.2933 2.2911 1.5155 2.0752 1.2053 1.2058 2.1076 1.0954 2.4198 1.2751 1.0971 1.3852 1.7307 1.0395 1.0393 1.0480 1.0479 6.0332 1.8899 2.7791 1.0846 1.0357 1.0355 1.0567 1.0572 1.0573 1.0738 1.0758 1.0839 1.1055 1.1039 1.0988 1.0988 1.1064 1.1042 1.1051 1.1038 1.0918 1.0985 1.0443 1.1056
irintensity: 1.9540 0.5136 0.4932 0.8534 0.8668 0.2636 0.9596 0.0939 2.8735 1.2186 1.1460 6.7586 1.5039 0.2321 1.1171 1.4464 2.9851 0.0291 0.0462 5.0724 4.4367 0.3278 5.7510 1.0074 3.3681 2.1341 0.9909 8.8671 1.1339 4.1808 259.7906 3.8992 0.2693 8.2340 2.3594 6.1893 47.9139 1.1819 4.2310 15.4430 29.0462 40.4986 1.3084 10.4939 13.1148 19.5278 53.7708 11.4062 2.2920 87.3770 31.7304 11.9246 74.1321 7.8288 11.6518 15.4691 16.1015 21.5114 0.4249 4.7555 35.0936 24.9583 8.7383 25.3080 6.8358 7.0899 12.8607 56.4400 4.5214 39.9704 56.0743 36.7379 8.5636 0.5602 17.4031 54.5226 14.4019 8.5186 5.6512 49.7323 5.4212 14.9538 11.9304 160.1560 8.2850 6.2806 19.5185 19.8580 19.0341 10.9561 52.3698 10.3501 5.8514 22.1180 10.9255 14.3032 14.7770 8.3803 7.2680 64.7069 27.5411 652.5909 29.1556 41.8916 33.8089 26.9808 10.1978 19.3942 9.1773 39.6879 20.8917 2.5155 0.4549 30.4729 26.6584 24.8671 38.5828 45.4279 9.6037 14.1466 0.0048 137.9124 50.2212
temp: 298.150 k
press: 1.00000 atm
elementType: 16 16 8 7 7 7 7 7 6 6 6 6 6 6 6 6 6 6 6 6 6 6 1 1 1 1 1 1 1 1 1 1 1 1 1 1 1 1 1 1 1 1 1
symmnumber: 1
zpe: 904704.5 jmol-1
zpe.correction: 0.344584 hartree
zpe.thermalcorrener: 0.367118 hartree
zpe.thermalcorrenthalpy: 0.368062 hartree
zpe.thermalcorrgfe: 0.288115 hartree
zpe.sumelectzpe: -1689.528010 hartree
zpe.sumelectthermal: -1689.505476 hartree
zpe.sumelectthermalent: -1689.504532 hartree
zpe.sumelectthermalfe: -1689.584479 hartree
dipole: -0.9846 2.3327 -0.5933
dipole: 2.6006
quadrupole: -133.5462 -143.9288 -139.8226
quadrupole: 3.8592 -6.3895 4.5045
quadrupole: 5.5530 -4.8296 -0.7234 3.8592 -6.3895 4.5045
hfenergy: -1689.8725939 hartree
pointgroup: C01 [X(C14H21N5O1S2)]
dipole: 0.3096305 0.6363346 -0.738935 debye
polarizability: 257.5170213|-25.1224466|196.493587|5.0043917|-10.0877236|224.6637354 unknown
InChI: InChI=1S/C14H21N5OS2/c1-3-21-6-9-10(22-4-2)5-11(20-9)19-8-18-12-13(15)16-7-17-14(12)19/h7-11H,3-6,15H2,1-2H3
charge 0 multiplicity 1
43 atoms
S  3.880572 0.258528 0.026438
S  0.821938 -3.22006 2.245966
O  0.271481 -0.037306 1.855179
N  -1.096948 1.530812 0.626981
N  -3.335988 1.965302 0.302537
N  -0.53539 0.706103 -1.675086
N  -2.494402 0.738548 -3.165149
N  -4.629515 1.461723 -2.452234
C  2.00386 0.337473 0.211468
C  1.537993 -0.633755 1.323291
C  1.452653 1.708959 0.66607
C  0.142436 1.360443 1.413254
C  1.255383 -2.047185 0.82134
C  -1.372545 1.193414 -0.709161
C  -2.316621 1.972456 1.17542
C  4.039759 0.949361 -1.739101
C  -2.755554 1.478641 -0.883731
C  1.68412 -4.786312 1.601939
C  5.504829 0.856835 -2.187354
C  -3.31103 1.22941 -2.172666
C  -1.180749 0.510212 -2.864429
C  1.486721 -5.923735 2.614437
H  1.545895 0.063258 -0.753636
H  2.266455 -0.663738 2.159222
H  2.156697 2.180028 1.37398
H  1.283053 2.393848 -0.179327
H  -0.002032 1.981728 2.315896
H  2.171207 -2.435698 0.340246
H  0.427889 -2.032386 0.092751
H  -2.391173 2.277824 2.217528
H  3.37745 0.3510 -2.388305
H  3.687252 1.994733 -1.732627
H  1.242751 -5.04421 0.62339
H  2.754915 -4.552586 1.464892
H  6.165943 1.439957 -1.521591
H  5.856289 -0.190139 -2.190666
H  5.613639 1.258364 -3.211856
H  -0.569699 0.119968 -3.6841
H  1.916684 -5.661095 3.597534
H  0.414628 -6.147967 2.757334
H  1.984923 -6.844116 2.257222
H  -4.980156 1.261176 -3.386495
H  -5.246011 1.816283 -1.723903
