program: Gaussian 09
title: 000266538
version: EM64L-G09RevD.01
frameworkgroup: C1[X(C8H15NO3)]
method: RPBEPBE
basis: SDD
operation: Freq
keyword: #p
keyword: freq=noraman
keyword: PBEPBE/SDD
title: #p freq=noraman PBEPBE/SDD
converged: NO YES NO NO
title: Mulliken charges:
elementType: O O O N C C C C C C C C H H H H H H H H H H H H H H H
charge: -0.475967 -0.410346 -0.240207 -0.606779 -0.024073 -0.094839 -0.474253 -0.441400 -0.401743 -0.394317 -0.262513 0.121337 0.253385 0.226772 0.216815 0.219277 0.183170 0.213167 0.193156 0.200656 0.197052 0.201969 0.312721 0.335112 0.282991 0.292103 0.376753
chargesum: 0.00000
title: Mulliken charges with hydrogens summed into heavy atoms:
elementType: O O O N C C C C C C C C
charge: -0.140855 -0.033593 -0.240207 -0.031684 0.229312 0.131932 -0.038161 -0.045063 -0.007931 0.004704 0.050208 0.121337
polarizability: 1.12452442e+02 5.04950978e+00 9.67559530e+01 1.15140299e-01 -5.00717336e-01 9.08999353e+01
1716.lowfreq: -35.7750 -19.8396 -5.8200 -0.0007 -0.0003 0.0005 36.9652 57.0331 85.0917
frequency: 36.8602 56.3575 85.0669 121.2004 146.7309 171.4842 193.3426 243.5051 278.6472 290.1880 310.1962 367.1826 396.8990 403.5633 424.7006 453.1402 531.0797 542.6444 603.6521 626.9527 682.6043 728.0869 784.5593 806.9023 837.8278 868.5741 876.1179 910.2213 947.2401 979.6034 1011.7680 1041.6654 1045.4816 1052.5538 1088.8458 1100.6101 1123.3830 1141.1858 1153.5555 1177.1918 1219.6421 1231.2409 1244.1219 1257.9595 1275.4962 1298.8877 1306.7033 1316.9754 1328.8321 1338.2052 1344.3711 1347.2086 1384.1308 1391.6718 1463.4342 1463.5660 1470.0957 1476.7548 1641.5442 1655.5288 2961.7567 2963.7006 2968.8801 2972.8844 2973.8552 3001.0651 3025.1658 3029.2174 3035.3081 3039.7930 3046.9448 3463.3058 3501.7411 3567.9867 3588.1043
redmass: 4.8233 6.1747 3.4469 3.5584 1.7138 1.7241 4.2250 3.1777 1.1210 3.7356 1.7220 3.3716 3.4374 3.7085 3.4710 2.9036 2.3375 2.3377 3.3355 1.4746 1.5726 3.0753 2.2218 2.7833 1.6992 2.1650 2.4400 1.8633 2.3447 2.8108 2.8815 2.4884 1.4710 1.6973 1.3942 2.0445 2.4572 1.2064 2.0422 1.7927 1.3618 1.3264 1.3387 1.2879 1.7256 1.3497 1.2893 1.2759 1.4291 1.4455 1.5358 1.4567 1.4119 1.5703 1.0891 1.0948 1.0847 1.0944 3.7452 1.3050 1.0825 1.0604 1.0610 1.0622 1.0646 1.0847 1.0998 1.0974 1.0994 1.0847 1.1026 1.0460 1.0640 1.0662 1.0965
irintensity: 0.2509 1.5645 1.2104 2.0605 10.5539 17.1327 1.2569 3.7976 124.1618 11.5639 0.2937 7.0064 12.0841 26.6584 6.3654 23.2771 16.0946 24.3562 4.5009 103.3202 264.7108 18.9747 0.6947 4.7620 8.9044 25.0286 2.8251 14.9960 7.2343 36.8220 41.0184 227.8980 5.6185 8.0012 2.7566 4.1783 6.5649 20.1031 23.8150 7.9713 17.3086 6.6506 1.7195 10.3110 16.7928 10.4539 8.1984 9.0566 2.6674 0.3803 1.6587 3.1058 2.8226 0.9158 8.4654 4.5307 17.5695 3.4154 268.9257 10.2374 11.3778 48.6402 31.8629 28.9694 34.1651 14.8155 46.0801 28.4196 39.4544 14.2081 104.1835 3.0357 14.2782 2.6058 9.4249
temp: 298.150 k
press: 1.00000 atm
elementType: 8 8 8 7 6 6 6 6 6 6 6 6 1 1 1 1 1 1 1 1 1 1 1 1 1 1 1
symmnumber: 1
zpe: 599553.1 jmol-1
zpe.correction: 0.228358 hartree
zpe.thermalcorrener: 0.241303 hartree
zpe.thermalcorrenthalpy: 0.242247 hartree
zpe.thermalcorrgfe: 0.188904 hartree
zpe.sumelectzpe: -593.308382 hartree
zpe.sumelectthermal: -593.295437 hartree
zpe.sumelectthermalent: -593.294493 hartree
zpe.sumelectthermalfe: -593.347836 hartree
dipole: 1.4886 0.3920 0.0156
dipole: 1.5395
quadrupole: -69.5971 -69.9988 -71.6826
quadrupole: -0.0125 4.1229 5.9977
quadrupole: 0.8291 0.4274 -1.2564 -0.0125 4.1229 5.9977
hfenergy: -593.5367402 hartree
pointgroup: C01 [X(C8H15N1O3)]
dipole: -0.5934758 -0.1203712 -0.0116998 debye
polarizability: 112.969455|4.0946709|96.1246313|0.5494447|0.952854|91.0142435 unknown
InChI: InChI=1S/C8H15NO3/c9-7(8(11)12)5-3-1-2-4-6(5)10/h5-7,10-11H,1-4,9H2
charge 0 multiplicity 1
27 atoms
O  -1.172522 -2.211383 -0.678831
O  2.437381 0.030851 -1.602802
O  3.122671 0.660065 0.521736
N  1.098032 -0.919033 1.729798
C  -0.219583 -0.036213 -0.238513
C  -1.429835 -0.94377 0.045897
C  -0.424478 1.355886 0.404805
C  -2.752308 -0.297089 -0.41559
C  -1.74901 2.011774 -0.052727
C  -2.95595 1.090009 0.239236
C  1.087573 -0.743344 0.270858
C  2.313652 0.040296 -0.207711
H  -0.129917 0.069614 -1.338503
H  -1.463119 -1.140505 1.139538
H  0.428516 2.017252 0.155459
H  -0.434837 1.241684 1.507421
H  -3.60249 -0.96654 -0.169146
H  -2.725689 -0.193786 -1.519052
H  -1.702336 2.217451 -1.142095
H  -1.88161 2.987239 0.453742
H  -3.066979 0.969655 1.336618
H  -3.893428 1.547177 -0.130837
H  1.094258 -1.732547 -0.221524
H  -1.921168 -2.835348 -0.504819
H  1.453348 -1.828613 2.034523
H  1.562778 -0.148358 2.222587
H  3.233051 0.569272 -1.865968
