program: Gaussian 09
title: 000266536
version: EM64L-G09RevD.01
frameworkgroup: C1[X(C6H7FN2OS)]
method: RPBEPBE
basis: SDD
operation: Freq
keyword: #p
keyword: freq=noraman
keyword: PBEPBE/SDD
title: #p freq=noraman PBEPBE/SDD
converged: NO NO NO NO
title: Mulliken charges:
elementType: S F O N N C C C C C C H H H H H H H
charge: 0.233965 -0.163709 -0.224603 -0.349302 0.019085 -0.558705 -0.169713 -0.660153 0.109105 0.219259 -0.343419 0.286194 0.286173 0.350969 0.232613 0.232685 0.233025 0.266529
chargesum: 0.00000
title: Mulliken charges with hydrogens summed into heavy atoms:
elementType: S F O N N C C C C C C
charge: 0.233965 -0.163709 -0.224603 0.001667 0.019085 0.013663 -0.169713 0.038171 0.109105 0.219259 -0.076890
polarizability: 1.64294751e+02 -6.53458211e+00 1.00559367e+02 8.35973894e-02 -2.70781055e-02 4.80491004e+01
1716.lowfreq: -19.4316 -9.3307 -0.0025 -0.0025 -0.0011 4.9083 34.6735 45.3857 103.3404
frequency: 34.6448 44.0845 103.3395 103.9623 157.8248 227.7586 251.7145 270.2222 286.4999 351.2482 386.6309 400.3564 493.7510 551.5203 622.2417 636.1291 638.0580 710.4649 721.1784 757.5260 775.8581 900.4655 907.5790 991.3092 1047.5967 1062.1224 1072.7536 1126.7044 1207.6929 1231.1873 1237.3449 1277.4443 1333.5105 1398.6269 1413.7031 1448.5592 1470.3691 1481.5252 1504.0502 1557.0090 1655.5961 2991.4008 3055.4552 3087.5703 3090.1262 3136.6394 3166.4178 3481.1330
redmass: 3.5041 2.2638 6.2177 6.4813 7.1765 1.1002 7.4651 5.0682 8.9057 11.2465 2.9383 10.2126 8.5691 8.3706 5.0712 9.3244 9.1710 2.0472 7.2776 2.3695 1.1186 1.4246 6.8866 1.8531 1.2169 2.9218 3.6628 4.1951 4.1146 1.2257 2.8261 1.2507 2.0406 1.2028 2.4987 1.0843 1.0389 1.0511 4.8199 6.7044 7.6630 1.0355 1.0596 1.0973 1.1015 1.1086 1.0931 1.0778
irintensity: 0.0000 1.3916 0.6246 0.6039 9.9466 0.1433 0.9672 1.0180 0.4520 2.3578 11.2946 6.0032 5.0447 4.6877 2.7403 46.2729 7.3621 16.4297 3.2114 75.2161 20.3535 18.5320 15.1632 29.7779 0.1580 16.5912 3.3852 89.2442 158.7314 0.6389 105.0853 25.2211 7.6448 20.2532 8.3599 14.5700 16.8591 10.7554 389.3716 25.8413 522.3628 25.4782 3.0226 19.5492 15.0613 16.9048 14.2555 37.2249
temp: 298.150 k
press: 1.00000 atm
elementType: 16 9 8 7 7 6 6 6 6 6 6 1 1 1 1 1 1 1
symmnumber: 1
zpe: 334110.5 jmol-1
zpe.correction: 0.127256 hartree
zpe.thermalcorrener: 0.138380 hartree
zpe.thermalcorrenthalpy: 0.139324 hartree
zpe.thermalcorrgfe: 0.088731 hartree
zpe.sumelectzpe: -914.642498 hartree
zpe.sumelectthermal: -914.631374 hartree
zpe.sumelectthermalent: -914.630430 hartree
zpe.sumelectthermalfe: -914.681023 hartree
dipole: -5.7994 1.2351 0.0023
dipole: 5.9295
quadrupole: -80.4546 -69.9683 -71.3374
quadrupole: 3.5362 -0.0670 0.0155
quadrupole: -6.5345 3.9518 2.5827 3.5362 -0.0670 0.0155
hfenergy: -914.769754 hartree
pointgroup: C01 [X(C6H7F1N2O1S1)]
dipole: -2.2916635 0.4114539 0.1452499 debye
dipolederiv: -0.8633006 0.000092 0.0366425 -0.1571466 -0.1273713 0.0031816 0.0212519 -0.0045824 -0.0811591 -1.0799769 -0.3095873 0.0150798 -0.4181328 -0.2884969 0.0033001 0.0047954 -0.001704 -0.1181056 -1.0133861 0.3611283 0.0622629 0.6600395 -0.79217 -0.0690559 0.0884022 -0.0553878 -0.362497 -1.2196937 0.357075 0.0768316 -0.1054608 -0.324802 -0.0029588 0.0345431 -0.0237059 -0.2418755 -1.0096263 -0.0143272 0.035177 -1.0313763 -0.7644784 -0.0034333 -0.0573251 -0.0497695 -0.2062801 0.4500672 -0.2149225 -0.0358319 -0.3998758 0.1924377 0.0241699 -0.0518284 0.0156543 0.1386165 1.4165013 0.0098433 -0.0611939 0.9580608 0.7643056 0.0197939 0.0252908 0.0636764 0.0505809 -0.133997 -0.0075188 0.0100063 0.1929093 0.0184386 -0.0140629 0.0285311 -0.0040001 0.0680232 1.5058514 -0.5115142 -0.1024907 -0.8490903 0.9334136 0.0996965 -0.1319961 0.0846092 0.2603215 0.8488617 0.4041847 0.0013241 0.9257624 -0.1542224 -0.0601417 0.0484103 -0.0368068 0.0502263 0.7184945 -0.118477 -0.0446615 0.2803169 0.3823338 0.025544 -0.0084274 0.0431948 -0.0374868 -0.007168 0.0012146 -0.0437949 0.0666671 -0.0051949 -0.0750065 -0.0487096 -0.0565776 -0.0193862 0.0023861 -0.0004878 0.0425603 0.0643144 -0.0290952 0.068091 0.0596093 0.0561269 -0.0060455 0.1861964 -0.0128683 0.0051227 -0.0310929 0.1899885 -0.0113378 0.0038777 -0.0123084 0.3323344 0.0886139 -0.0147991 -0.0255419 -0.09199 0.0588977 -0.0932611 -0.0774917 -0.0870885 -0.0701176 0.0972639 -0.0073335 0.0077202 -0.0915927 0.0212392 0.1205636 0.044535 0.106047 -0.0405874 -0.0677882 0.097165 0.0189152 0.1125693 -0.04247 -0.0215466 0.0205923 -0.020872 0.1244704 0.0807005 -0.0188672 0.0018723 -0.0848815 -0.0327537 -0.0135361 -0.0040608 -0.0165058 0.1589677 unknown
polarizability: 164.3633993|-4.264378|99.7827971|-5.7244547|4.8987362|48.7570227 unknown
InChI: InChI=1S/C6H7FN2OS/c1-2-11-6-8-3-4(7)5(10)9-6/h3,9H,2H2,1H3
charge 0 multiplicity 1
18 atoms
S  -2.20586 -1.061331 0.033049
F  3.319631 1.162935 -0.011876
O  2.814566 -1.671422 -0.244913
N  0.512879 -1.20172 -0.10109
N  -0.378131 0.99817 0.136566
C  -3.269359 0.502241 0.232007
C  -0.548234 -0.316367 0.025787
C  -4.746588 0.087766 0.272843
C  1.900029 -0.813763 -0.127554
C  2.026209 0.640989 -0.001896
C  0.930615 1.472267 0.12141
H  -2.938579 0.995567 1.158255
H  -3.033309 1.158287 -0.619215
H  0.348467 -2.21262 -0.184197
H  -5.056377 -0.418448 -0.658287
H  -4.960818 -0.582404 1.123853
H  -5.369372 0.993171 0.389525
H  1.059932 2.554983 0.212835
