program: Gaussian 09
title: 000266535
version: EM64L-G09RevD.01
frameworkgroup: C1[X(C10H9NO2)]
method: RPBEPBE
basis: SDD
operation: Freq
keyword: #p
keyword: freq=noraman
keyword: PBEPBE/SDD
title: #p freq=noraman PBEPBE/SDD
converged: NO NO NO NO
title: Mulliken charges:
elementType: O O N C C C C C C C C C C H H H H H H H H H
charge: -0.160654 -0.167231 -0.437626 -0.039362 0.254214 0.339080 0.352136 -0.034850 -0.378931 -0.399798 -0.813669 0.040698 -0.811743 0.243538 0.237092 0.328843 0.293156 0.230787 0.230912 0.231259 0.230898 0.231251
chargesum: 0.00000
title: Mulliken charges with hydrogens summed into heavy atoms:
elementType: O O N C C C C C C C C C C
charge: -0.160654 -0.167231 -0.108782 -0.039362 0.254214 0.339080 0.352136 -0.034850 -0.135393 -0.162705 -0.058814 0.040698 -0.118335
polarizability: 1.77695609e+02 -5.33982997e+00 1.34241025e+02 -5.88108302e-04 -2.37411247e-03 5.61728256e+01
1716.lowfreq: -0.0002 0.0006 0.0008 7.7650 9.8923 16.3715 86.0079 88.6426 104.0927
frequency: 85.9887 88.4986 104.0832 154.6480 178.6938 219.2698 230.4096 296.0040 308.5654 349.9005 396.5363 411.7810 415.1996 495.0724 533.0358 580.4704 594.7813 611.9278 612.4406 656.3953 730.2756 759.2355 788.7976 811.7538 827.9635 934.6841 947.6302 979.2180 1026.8511 1041.9871 1053.4629 1091.6796 1154.3454 1175.5329 1206.8732 1252.7780 1262.5994 1329.0921 1394.5908 1396.8241 1409.7955 1423.9089 1463.5295 1468.9662 1472.0576 1483.1395 1485.4400 1613.8617 1620.1726 1650.0025 1686.1190 2967.5491 2971.0275 3037.4087 3041.9965 3079.6818 3111.7616 3124.5725 3151.0774 3564.9278
redmass: 6.3760 1.0602 3.7772 1.2226 2.8720 5.0655 3.6913 3.8906 4.8648 4.2627 4.4406 4.6973 6.5328 3.1208 3.9911 6.7499 2.6323 5.2246 1.4934 7.4386 4.5829 4.9185 5.6381 7.2418 1.4273 2.7195 1.3643 1.6557 1.4463 2.7718 1.6349 2.2724 1.5903 5.6610 3.2092 2.1266 2.1975 3.2619 2.1545 1.3742 1.3982 2.0406 1.0467 1.8044 1.8947 1.2534 1.0472 6.6608 7.3314 11.8582 10.3981 1.0378 1.0399 1.0960 1.0965 1.0983 1.0978 1.0885 1.0965 1.0797
irintensity: 0.0882 0.3310 2.1427 2.2394 0.2253 4.2782 4.6102 1.2576 2.8753 0.3518 1.0981 1.2261 1.0954 5.5366 0.7193 3.2571 29.5622 2.7129 101.8416 9.1495 0.3523 3.0921 6.3034 2.6157 48.7778 21.1831 1.8372 8.0517 10.1537 40.2566 0.3029 1.6968 4.1764 82.3532 6.7444 13.8329 16.2115 4.0697 29.0375 4.8656 66.2098 28.9156 5.3661 100.1103 7.7680 39.0008 30.4270 18.1683 465.9486 120.0238 235.7335 44.6492 7.5090 32.4699 2.0280 18.7686 1.2523 14.3960 13.9476 38.6856
temp: 298.150 k
press: 1.00000 atm
elementType: 8 8 7 6 6 6 6 6 6 6 6 6 6 1 1 1 1 1 1 1 1 1
symmnumber: 1
zpe: 438532.3 jmol-1
zpe.correction: 0.167028 hartree
zpe.thermalcorrener: 0.178515 hartree
zpe.thermalcorrenthalpy: 0.179460 hartree
zpe.thermalcorrgfe: 0.129875 hartree
zpe.sumelectzpe: -590.762815 hartree
zpe.sumelectthermal: -590.751328 hartree
zpe.sumelectthermalent: -590.750384 hartree
zpe.sumelectthermalfe: -590.799968 hartree
dipole: 5.7398 -3.9123 0.0003
dipole: 6.9463
quadrupole: -85.1360 -69.1841 -76.4319
quadrupole: 10.2420 0.0025 0.0014
quadrupole: -8.2186 7.7332 0.4854 10.2420 0.0025 0.0014
hfenergy: -590.9298436 hartree
pointgroup: C01 [X(C10H9N1O2)]
dipole: 2.3372554 1.4145582 -0.0708767 debye
dipolederiv: -0.5766642 -0.1553355 0.0086492 -0.3704621 -0.9161392 0.0168062 0.0116391 0.0120842 -0.2813848 -1.3570546 -0.0790436 0.0239842 0.0182681 -0.3830896 0.0004874 0.0226766 0.0026204 -0.3177838 -1.4410384 0.0212781 0.0241 -0.5372502 -0.4244865 0.0131111 0.0316004 0.0008154 -0.3357142 -0.8560394 -0.3758989 0.0227462 0.094131 -0.3667259 0.0020994 0.0164155 0.0124571 -0.0572771 0.1935277 0.282141 -0.0076624 -0.3209222 0.4859457 0.0007996 0.0004856 -0.0125473 0.0171271 1.3682343 -0.2488542 -0.0248238 -0.0251603 0.1141302 0.0001876 -0.0279046 0.0051409 0.0905059 0.3082792 -0.2715027 -0.0048927 -0.0555612 -0.468399 0.0065735 -0.0080632 0.0114397 -0.0724809 1.0510112 0.4605163 -0.0251885 0.4857596 0.9390327 -0.0208969 -0.0255586 -0.0203148 0.1943601 -0.7242379 0.123524 0.009854 -0.1599871 0.0827423 -0.0003246 0.0136806 -0.0065707 -0.2036936 0.2947642 -0.1202306 -0.0076988 -0.0728384 0.2412624 -0.0033854 -0.0082869 -0.0023668 -0.1267059 -0.0969349 0.1075506 0.0015455 0.0878894 -0.2385198 0.0017516 0.0016273 0.0013865 0.0392822 1.5766086 0.3247777 -0.0343144 0.7703138 0.6452776 -0.0227607 -0.0403127 -0.012912 0.2186648 -0.0726746 0.0653849 0.002239 0.131416 0.03667 -0.0024933 0.001594 -0.0010837 0.0660323 0.0687677 0.0565256 0.001711 0.0357008 -0.0875351 0.0028164 0.0019733 0.0023472 0.1805371 -0.0533226 -0.107497 0.0058115 -0.0896382 0.026156 0.0035715 0.0055796 0.0039987 0.1437652 0.1528512 -0.0387406 0.0050039 -0.0248252 0.1533831 0.003257 0.0048271 0.0035229 0.3557504 0.0421831 -0.1372403 0.0033252 -0.013713 0.0873051 0.0006752 0.0017807 0.0033668 0.1182748 0.0623013 0.0478151 0.1079332 0.0391165 0.0400288 -0.0140386 0.0996938 -0.0667701 -0.0329307 0.0532743 0.0476302 -0.1128574 0.0369599 0.0420291 0.0106463 -0.1043233 0.0628432 -0.0257627 0.0173959 0.0229405 -0.0055825 0.0731378 0.0177438 -0.1164596 0.0664765 -0.1095434 -0.0397979 -0.0258571 -0.0535644 0.003725 -0.178738 -0.0503184 0.0060394 0.0053728 0.0032956 0.1118837 0.014625 0.0278236 0.0023926 0.076403 0.0235068 0.1115369 -0.0709737 0.1067901 -0.0426521 unknown
polarizability: 178.0841806|2.9346208|133.7768992|-2.7380095|-1.1100374|56.2483796 unknown
InChI: InChI=1S/C10H9NO2/c1-5-3-4-7-8(6(5)2)9(12)10(13)11-7/h3-4,11H,1-2H3
charge 0 multiplicity 1
22 atoms
O  -1.792259 -2.093527 0.085529
O  -3.749158 0.239341 0.096883
N  -1.714968 1.470081 0.035506
C  -0.1250 -0.242802 0.023495
C  1.176024 -0.804146 0.002273
C  -0.329868 1.171568 0.008978
C  2.292447 0.096658 -0.034454
C  -1.457423 -0.885094 0.061616
C  0.750979 2.06015 -0.02683
C  2.054306 1.494562 -0.047987
C  1.385963 -2.303479 0.017513
C  -2.502823 0.30768 0.068516
C  3.713851 -0.43537 -0.059263
H  0.611563 3.146535 -0.038369
H  2.916624 2.17193 -0.076244
H  -2.109703 2.411568 0.031736
H  0.429618 -2.84688 0.044864
H  1.951229 -2.631468 -0.876936
H  1.988831 -2.608574 0.895321
H  3.895935 -1.077691 -0.942877
H  4.446546 0.389686 -0.086166
H  3.935285 -1.054927 0.8315
