program: Gaussian 09
title: 000266534
version: EM64L-G09RevD.01
frameworkgroup: C1[X(C9H11NO2)]
method: RPBEPBE
basis: SDD
operation: Freq
keyword: #p
keyword: freq=noraman
keyword: PBEPBE/SDD
title: #p freq=noraman PBEPBE/SDD
converged: NO NO NO NO
title: Mulliken charges:
elementType: O O N C C C C C C C C C H H H H H H H H H H H
charge: -0.445051 -0.322946 -0.686319 0.367497 0.405517 0.105041 0.348952 -0.540807 -0.640375 -0.820020 -0.815196 0.124681 0.273454 0.223946 0.221663 0.235077 0.221592 0.230287 0.229093 0.229162 0.301938 0.372327 0.380486
chargesum: 0.00000
title: Mulliken charges with hydrogens summed into heavy atoms:
elementType: O O N C C C C C C C C C
charge: -0.064564 -0.322946 -0.012054 0.367497 0.405517 0.105041 0.348952 -0.267353 -0.416429 -0.141689 -0.126653 0.124681
polarizability: 1.66736396e+02 2.10002767e+00 1.31184367e+02 2.19283522e-03 3.43883428e-03 5.52037721e+01
1716.lowfreq: 0.0005 0.0008 0.0010 11.6580 17.2245 21.4466 83.1733 103.6414 133.4003
frequency: 83.1712 103.6282 133.3902 150.5797 195.9909 198.7494 243.8281 293.9269 333.6292 340.9912 353.3342 406.1911 443.6536 467.8826 468.9406 542.8463 561.2211 580.2926 612.0505 669.8969 696.1587 715.4991 729.7887 775.7868 810.2136 866.5420 921.1316 979.3762 1000.7244 1009.1979 1033.6108 1053.9740 1081.2650 1107.8305 1170.9633 1228.0688 1286.1467 1306.4588 1337.7739 1390.8766 1396.9296 1407.0805 1431.8720 1460.6481 1473.6625 1476.4715 1481.0636 1504.5078 1547.1360 1585.1424 1627.6344 1651.4311 2961.9408 2969.2629 3031.4645 3042.9390 3077.5243 3083.2264 3108.3773 3158.7093 3421.3157 3531.2433 3645.3855
redmass: 4.4087 6.6194 1.0611 2.6739 1.1671 5.0141 3.3808 2.5333 3.7651 3.4759 4.6705 6.1931 2.6074 5.4109 1.1667 3.5669 1.2526 4.0464 3.5564 4.5728 4.1483 1.1608 5.7425 3.2223 3.5328 1.5189 1.3855 3.5162 1.5917 1.5546 1.4541 1.6292 1.5853 2.1953 2.2079 1.8104 1.2803 4.4875 4.0044 1.8933 1.9527 1.3183 2.8158 1.0469 1.3076 1.0456 1.2681 2.6077 3.2153 4.8101 1.6839 6.5810 1.0379 1.0377 1.0971 1.0965 1.0978 1.0985 1.0910 1.0916 1.0542 1.0640 1.0963
irintensity: 0.2354 0.1581 0.0247 7.2477 0.4112 0.0469 0.1016 0.4481 9.6923 1.8095 1.7173 5.4037 42.5918 1.2337 113.4136 16.7082 117.5138 14.8627 31.5702 13.7869 8.6512 112.5228 3.9429 43.9545 3.8968 25.7739 5.0947 212.6804 9.5020 40.3458 20.5243 0.0023 23.1068 189.1739 50.8389 2.5644 8.0065 0.9494 160.2771 1.7177 4.5104 15.0469 0.5517 1.4033 21.4803 29.8982 2.6488 32.3566 215.9418 305.7926 62.2822 271.7524 54.0121 27.8827 31.7419 14.1022 27.5715 12.6753 24.8073 2.0950 109.4540 51.2256 48.0873
temp: 298.150 k
press: 1.00000 atm
elementType: 8 8 7 6 6 6 6 6 6 6 6 6 1 1 1 1 1 1 1 1 1 1 1
symmnumber: 1
zpe: 483055.4 jmol-1
zpe.correction: 0.183986 hartree
zpe.thermalcorrener: 0.195641 hartree
zpe.thermalcorrenthalpy: 0.196586 hartree
zpe.thermalcorrgfe: 0.147157 hartree
zpe.sumelectzpe: -553.910086 hartree
zpe.sumelectthermal: -553.898431 hartree
zpe.sumelectthermalent: -553.897487 hartree
zpe.sumelectthermalfe: -553.946915 hartree
dipole: -2.0103 0.9356 0.0001
dipole: 2.2174
quadrupole: -66.1754 -59.5829 -74.5110
quadrupole: -3.2015 -0.0034 0.0012
quadrupole: 0.5810 7.1735 -7.7545 -3.2015 -0.0034 0.0012
hfenergy: -554.0940722 hartree
pointgroup: C01 [X(C9H11N1O2)]
dipole: -0.7951247 -0.358827 0.0077599 debye
dipolederiv: -0.4713785 -0.352353 -0.0081831 -0.6324749 -1.2646509 -0.0083039 -0.015783 -0.014825 -0.425307 -1.2899362 0.1287128 0.0234399 0.2786022 -0.6579278 -0.0138446 0.026663 -0.0103272 -0.3640587 -0.6768434 0.6778674 0.0181589 0.4759267 -0.9617557 -0.0180334 0.0129329 -0.0226312 -0.6638184 -0.341202 -0.42844 -0.0059745 -0.4728841 -0.1773942 0.0082374 -0.0071237 0.0074842 -0.1031329 0.4534128 -0.0293567 -0.0104779 0.2866344 0.4504997 0.0055239 -0.0018229 0.0123577 0.0020151 -1.0890396 -0.4596609 0.0099456 0.089584 -0.3675936 -0.009752 0.0243684 0.0020467 -0.0698253 0.7084014 -0.8187729 -0.0335376 -0.3069277 0.8870458 0.0258614 -0.0200896 0.0369389 0.1510131 0.5376749 0.29694 -0.0063609 -0.2923355 -0.0526596 0.0078626 -0.0215904 -0.0048352 -0.1113919 -0.4369256 0.5238708 0.0177232 0.0725678 -0.0624059 0.0032716 0.0058883 -0.0064753 -0.2478591 -0.0128132 0.0868537 0.0044065 0.0392845 0.0146802 -0.0027536 0.0031808 -0.0039002 0.0896856 -0.2173288 -0.0435268 0.0045806 0.0351883 0.0859142 0.0000361 0.0059449 0.0016349 0.0521151 2.1059846 0.451715 -0.0287293 0.4272221 1.4480402 0.022939 -0.0286899 0.0225753 0.2254396 0.1167311 -0.0238538 0.0000331 -0.0190409 -0.0289691 -0.0041214 0.0001572 -0.0040202 0.1464764 0.0416599 -0.0353128 0.0017031 -0.0580208 -0.1312894 -0.0063296 0.0011347 -0.0067856 0.1610167 -0.0475429 0.0604475 0.1135765 0.026542 0.0565196 0.0453163 0.1501789 -0.0203041 -0.0611864 0.03939 -0.1522615 -0.0022841 -0.022951 -0.0994514 -0.004691 0.0009418 -0.001881 0.10877 -0.0590275 0.0669552 -0.1104251 0.03209 0.057661 -0.0410491 -0.1487528 0.0231455 -0.0506668 0.0711777 0.0227329 0.0013764 -0.102564 -0.1514038 -0.0041434 -0.0016473 -0.0068939 0.1083396 -0.0168886 0.0081618 0.0615442 0.0243434 0.0700751 -0.095125 0.1182106 -0.0608855 -0.0474925 -0.0246401 0.01376 -0.0617731 0.0341859 0.0621675 0.0990614 -0.1173606 0.0656383 -0.0320725 0.1596639 -0.0743799 0.0025055 -0.0628926 0.1936906 -0.0031984 0.0027983 -0.002959 0.3678708 0.3021925 0.0277772 0.0021707 0.0007698 0.27775 -0.0024861 0.0013976 -0.002872 0.370888 0.1472779 0.0521238 0.0065815 0.1471507 0.3514575 -0.004278 0.0090626 -0.002226 0.3931815 unknown
polarizability: 166.6286308|-2.4653268|131.1859241|-2.4668931|2.0338109|55.3099809 unknown
InChI: InChI=1S/C9H11NO2/c1-5-3-7(9(11)12)8(10)4-6(5)2/h3-4,11H,10H2,1-2H3
charge 0 multiplicity 1
23 atoms
O  2.54763 1.862691 -0.039995
O  3.243683 -0.345528 -0.112581
N  1.347458 -2.26273 -0.122099
C  -1.516697 0.897137 0.022172
C  -1.933051 -0.481081 -0.004515
C  0.850171 0.150449 -0.048587
C  0.433387 -1.229142 -0.075386
C  -0.141964 1.173548 -0.000619
C  -0.9694 -1.501869 -0.051991
C  -2.535986 2.021511 0.073108
C  -3.40814 -0.835335 0.017984
C  2.276636 0.480883 -0.07089
H  0.205086 2.211151 0.018683
H  -1.298612 -2.549326 -0.072006
H  -3.17661 1.958558 0.974973
H  -2.035316 3.005041 0.086694
H  -3.216067 2.00285 -0.801423
H  -3.562077 -1.927608 -0.00537
H  -3.903666 -0.439553 0.925721
H  -3.940641 -0.3964 -0.848022
H  1.031837 -3.229381 -0.140646
H  2.345586 -2.026156 -0.136974
H  3.535053 1.979994 -0.057731
