program: Gaussian 09
title: 000266529
version: EM64L-G09RevD.01
frameworkgroup: C1[X(C9H13N5O3)]
method: RPBEPBE
basis: SDD
operation: Freq
keyword: #p
keyword: freq=noraman
keyword: PBEPBE/SDD
title: #p freq=noraman PBEPBE/SDD
converged: YES YES NO NO
title: Mulliken charges:
elementType: O O O N N N N N C C C C C C C C C H H H H H H H H H H H H H
charge: -0.310003 -0.243413 -0.343954 -0.419916 -0.418530 -0.385506 -0.455821 -0.055424 0.109526 0.410581 0.122682 0.139521 0.243208 0.185308 -0.766409 -0.767978 -0.771285 0.387628 0.354373 0.363908 0.409292 0.256760 0.232236 0.256839 0.248966 0.233059 0.232959 0.255791 0.255672 0.239930
chargesum: 0.00000
title: Mulliken charges with hydrogens summed into heavy atoms:
elementType: O O O N N N N N C C C C C C C C C
charge: -0.310003 -0.243413 -0.343954 -0.032288 -0.064158 -0.021598 -0.046529 -0.055424 0.109526 0.410581 0.122682 0.139521 0.243208 0.185308 -0.020574 -0.052995 -0.019892
polarizability: 2.42276830e+02 -1.97255275e+00 1.95882845e+02 -2.72367195e-02 2.76558366e-02 7.29113531e+01
1716.lowfreq: -8.2886 -5.0990 -0.0009 -0.0008 -0.0005 4.9912 44.1638 53.0833 72.8138
frequency: 44.1378 53.0758 72.8111 75.6550 84.0198 91.2485 114.9833 170.6137 175.4459 177.2705 194.2297 202.8758 230.9022 246.9460 300.6944 323.1402 335.6149 372.6584 381.9704 423.6893 484.7159 514.6277 521.5465 548.5968 582.3311 608.1191 627.0688 650.5108 677.7115 700.4918 707.3716 743.3364 812.3285 819.6694 831.5814 851.4797 927.9749 951.9638 967.7778 987.2932 996.1029 1018.5163 1036.8313 1047.7089 1078.2859 1086.5216 1128.5079 1209.5748 1239.1277 1260.6892 1318.9617 1330.0138 1347.3993 1386.3579 1390.8196 1396.4944 1399.7350 1436.7400 1449.9079 1457.8788 1459.2202 1469.6055 1473.5220 1482.4393 1499.6898 1536.2105 1587.2371 1611.5065 1624.7191 1673.7191 1679.8854 2815.9961 2970.2036 2978.1096 3001.1887 3043.7067 3052.1964 3095.4390 3108.0748 3110.0222 3112.6046 3353.8243 3445.0472 3548.3871
redmass: 6.1700 2.9470 3.4652 3.7624 4.1885 1.2619 1.0807 3.9458 4.7364 4.2221 2.0078 2.3903 3.9401 5.2962 6.7911 3.7017 4.6987 5.7090 7.1408 3.5260 4.4400 3.6364 8.4841 5.2387 3.6436 4.1934 5.4516 5.0425 1.9009 6.8509 4.6985 3.5433 5.1324 1.2209 1.1304 3.8588 6.1829 1.2660 1.4042 3.1191 2.8521 1.6535 1.0938 1.5614 1.6329 2.6299 3.1225 4.9675 5.1929 3.0851 2.7855 2.0960 1.7723 1.2449 3.6445 1.2570 1.3419 1.6571 1.0451 1.1943 1.0479 1.1166 1.0434 1.3466 3.4783 2.9127 4.3078 5.1769 3.2639 3.5960 5.7112 1.0992 1.0379 1.0390 1.0359 1.0969 1.0966 1.0977 1.0984 1.1016 1.0978 1.0764 1.0766 1.0774
irintensity: 3.0833 0.4592 0.4103 3.7884 0.3891 0.0114 0.5885 0.0240 15.3154 8.5182 0.4150 0.0160 2.0222 4.0012 7.4344 0.4372 0.7487 3.5365 11.4121 17.1479 35.0571 0.0482 23.6538 13.7288 0.0310 5.5285 13.1515 0.2552 35.6991 4.3574 5.4837 44.6689 6.3474 137.0922 86.2952 2.4854 10.4825 0.7256 3.9492 21.3608 33.8836 3.9770 60.3017 36.2564 13.5069 10.9045 92.7688 7.3462 21.8307 8.1155 13.4829 24.7558 58.2443 31.1753 139.0515 75.2526 9.2478 201.6349 18.0177 23.8723 19.9720 8.0723 12.3784 7.2395 317.5215 290.6239 494.8198 0.9201 86.2336 726.6439 854.8693 484.0393 28.9171 14.0639 11.0694 17.0875 10.5258 7.1041 14.3578 13.3191 23.3305 102.3840 151.6568 89.5521
temp: 298.150 k
press: 1.00000 atm
elementType: 8 8 8 7 7 7 7 7 6 6 6 6 6 6 6 6 6 1 1 1 1 1 1 1 1 1 1 1 1 1
symmnumber: 1
zpe: 606131.1 jmol-1
zpe.correction: 0.230863 hartree
zpe.thermalcorrener: 0.247969 hartree
zpe.thermalcorrenthalpy: 0.248913 hartree
zpe.thermalcorrgfe: 0.185446 hartree
zpe.sumelectzpe: -848.973302 hartree
zpe.sumelectthermal: -848.956196 hartree
zpe.sumelectthermalent: -848.955252 hartree
zpe.sumelectthermalfe: -849.018719 hartree
dipole: 3.8754 3.9017 0.0117
dipole: 5.4993
quadrupole: -93.5272 -107.5857 -100.3883
quadrupole: -7.4736 0.0211 0.0227
quadrupole: 6.9732 -7.0853 0.1121 -7.4736 0.0211 0.0227
hfenergy: -849.2041653 hartree
pointgroup: C01 [X(C9H13N5O3)]
dipole: 1.4521641 1.6032792 -0.0421101 debye
polarizability: 241.2361675|0.6646734|195.5532223|-13.7409723|5.4670072|74.2816381 unknown
InChI: InChI=1S/C9H13N5O3/c1-4(2)13-14-7-6(10-5(3)15)8(16)12-9(17)11-7/h10-12,14H,1-3H3
charge 0 multiplicity 1
30 atoms
O  -3.544192 0.050688 0.44273
O  -1.011614 -3.884141 0.054134
O  0.674162 2.722263 0.208068
N  0.062962 -1.803895 0.059803
N  -1.420218 1.664541 0.339557
N  -2.266835 -1.907149 0.247689
N  1.304569 0.182928 0.04872
N  2.4078 -0.666716 -0.078996
C  -1.15853 0.263146 0.25392
C  0.065252 -0.411318 0.122957
C  -2.395441 -0.501891 0.322036
C  -1.0686 -2.627835 0.115931
C  -0.608872 2.76752 0.319561
C  3.603749 -0.115495 -0.150533
C  -1.312558 4.108645 0.439583
C  4.778307 -1.053442 -0.288016
C  3.855546 1.380587 -0.103083
H  0.993066 -2.234667 -0.036238
H  -2.441869 1.802862 0.431622
H  -3.129174 -2.45621 0.294671
H  1.309776 1.247744 0.093728
H  -0.923866 4.642216 1.324196
H  -2.408203 4.022893 0.526134
H  -1.069721 4.724099 -0.443846
H  4.441344 -2.101906 -0.305207
H  5.340924 -0.843484 -1.218446
H  5.487742 -0.919652 0.551653
H  3.330394 1.907494 -0.923094
H  3.485479 1.824931 0.841169
H  4.931221 1.599741 -0.187206
