program: Gaussian 09
title: 000266525
version: EM64L-G09RevD.01
frameworkgroup: C1[X(C19H20Cl2N2O3)]
method: RPBEPBE
basis: SDD
operation: Freq
keyword: #p
keyword: freq=noraman
keyword: PBEPBE/SDD
title: #p freq=noraman PBEPBE/SDD
converged: YES YES NO NO
title: Mulliken charges:
elementType: Cl Cl O O O N N C C C C C C C C C C C C C C C C C C C H H H H H H H H H H H H H H H H H H H H
charge: -0.063307 -0.061998 -0.303078 -0.443373 -0.274862 -0.133359 -0.083691 0.499051 -0.418472 -0.417451 -0.529189 -0.377749 0.178272 0.345298 -0.557973 -0.556967 -0.416925 -0.370158 0.176631 0.115355 -0.556160 -0.371145 -0.301639 -0.207284 -0.251030 0.111718 0.277971 0.244439 0.240158 0.277055 0.246748 0.224676 0.266469 0.291745 0.265619 0.292093 0.272214 0.273216 0.211327 0.230382 0.288031 0.251400 0.274207 0.230707 0.232424 0.378604
chargesum: 0.00000
title: Mulliken charges with hydrogens summed into heavy atoms:
elementType: Cl Cl O O O N N C C C C C C C C C C C C C C C C C C C
charge: -0.063307 -0.061998 -0.303078 -0.064770 -0.274862 -0.133359 -0.083691 0.499051 0.103938 0.099763 -0.282441 -0.153073 0.178272 0.345298 0.000240 0.000745 -0.144711 -0.096942 0.176631 0.115355 0.173579 -0.119744 -0.027431 0.023423 -0.018605 0.111718
polarizability: 4.81777388e+02 2.19431366e+01 2.42827126e+02 -1.33870141e+00 -9.94355376e+00 1.67079106e+02
1716.lowfreq: -9.9366 -4.3990 -0.0012 0.0013 0.0014 2.3497 15.4326 18.7983 29.6436
frequency: 15.3711 18.7100 29.6339 32.8035 41.7165 51.3788 56.7158 75.3101 87.5483 91.0314 94.5436 102.6362 129.4971 142.1290 149.1738 168.6438 186.0800 194.6802 218.6388 219.0813 244.9262 282.4175 292.0102 311.9042 341.3397 368.0798 380.5768 394.0446 406.0030 422.6507 444.3589 481.7722 490.1313 504.6468 529.3507 537.7878 541.2759 561.0665 578.9377 599.8457 600.9273 605.6583 625.5828 656.6689 671.4854 685.7123 719.1711 737.3919 759.2470 779.7592 785.7353 816.3004 832.2342 840.1672 857.7922 870.9410 877.8841 892.6176 920.4869 948.8588 968.8195 969.3311 973.4773 986.9024 991.6763 995.0470 1007.8646 1030.2273 1039.0725 1049.2585 1094.2604 1111.6707 1119.4892 1148.0371 1153.8372 1160.7432 1162.7872 1174.2072 1177.1838 1185.0855 1194.1598 1227.5527 1248.7978 1260.8976 1261.9460 1293.5815 1299.3926 1304.1511 1305.1562 1348.1262 1355.0651 1355.9836 1373.4782 1382.8600 1395.8838 1428.1096 1432.4207 1441.2153 1441.7454 1451.8451 1465.8293 1468.2389 1470.8105 1487.7099 1491.4092 1519.2864 1547.8820 1551.6016 1597.8238 1619.2686 1624.2990 1650.8765 2963.2566 2982.6455 2985.4268 3041.8361 3055.4390 3055.9162 3066.3808 3075.6036 3081.5036 3120.1663 3132.1003 3143.7303 3144.3526 3145.5674 3152.5869 3165.1031 3168.8607 3173.4475 3181.9668 3529.2797
redmass: 9.2860 7.6675 8.0790 9.3051 10.2362 7.3396 6.6884 6.2335 5.7373 4.6084 3.5051 4.5381 3.1074 5.0304 3.4283 5.3279 1.6130 2.5049 3.7401 5.5775 4.6901 4.2970 5.1162 4.1546 5.1416 3.9086 3.2948 3.8849 3.5047 3.5031 3.6258 3.3533 4.6714 3.3369 2.9802 4.0634 3.5058 4.4541 1.2261 5.0037 4.8626 4.4935 5.2900 4.3589 4.6342 3.9358 5.2858 2.7380 2.4775 1.8687 3.9485 1.4999 4.9267 3.9181 1.7849 1.8160 1.5232 3.3300 1.8646 2.2945 1.6363 2.2436 1.4885 3.8772 1.3625 1.6444 1.8549 2.5073 2.3693 1.8393 2.8171 1.8797 1.2468 1.5987 1.4752 1.4380 1.1940 1.1089 2.0894 1.8046 1.7812 1.3552 1.4678 1.5989 1.6022 1.6245 1.2902 2.3518 1.2344 1.7979 1.5955 1.5277 8.1106 1.9032 2.1248 2.0371 2.3087 1.0994 1.1028 1.4754 2.3343 1.1085 1.2180 1.0810 1.2200 2.9245 6.5061 6.5654 6.6749 6.6899 7.4763 8.7916 1.0329 1.0679 1.0683 1.0895 1.0582 1.0581 1.1015 1.0939 1.0935 1.1030 1.0863 1.0992 1.1097 1.0991 1.0904 1.0963 1.0935 1.0913 1.0973 1.0641
irintensity: 0.1438 0.1012 0.4296 0.4544 0.7916 0.7570 2.1072 6.4763 0.8577 9.6709 1.5402 4.8265 3.3902 3.7512 4.5307 0.0582 1.2501 1.1238 2.4557 1.0026 4.9903 5.9189 3.6198 4.0513 2.8563 6.1313 4.1886 6.8493 8.1100 12.8190 21.6385 19.3204 8.4030 12.0118 12.6977 7.4223 16.8111 10.1833 105.0143 15.4986 22.9545 38.6010 0.9150 3.1940 9.2717 50.7912 9.3991 9.9031 53.4422 24.1773 23.5208 31.7568 38.0157 61.1475 25.1720 0.5774 4.0333 19.9621 101.6147 13.7801 30.0296 12.2982 1.4232 320.8330 9.7836 9.3927 3.4954 2.0536 36.8038 10.8605 123.2511 88.3644 2.9818 127.0638 37.0748 57.9736 2.9264 0.7278 44.4855 42.3328 49.2070 153.9043 29.2553 21.2481 30.7738 97.5087 27.1173 69.6401 33.5700 131.9045 241.1944 19.5442 6.0035 39.9566 43.9141 23.0621 19.2248 7.9890 7.9734 19.3903 81.6770 27.3331 11.5779 22.5413 5.0739 212.4416 31.8661 136.8231 264.5510 883.9651 421.4254 341.8732 67.9210 32.8248 27.3281 15.3500 24.6299 10.5233 11.7428 1.3556 6.0588 24.5083 6.7238 15.3640 24.7642 5.0115 14.8312 15.7311 17.5335 18.2384 16.3420 42.3383
temp: 298.150 k
press: 1.00000 atm
elementType: 17 17 8 8 8 7 7 6 6 6 6 6 6 6 6 6 6 6 6 6 6 6 6 6 6 6 1 1 1 1 1 1 1 1 1 1 1 1 1 1 1 1 1 1 1 1
symmnumber: 1
zpe: 929884.9 jmol-1
zpe.correction: 0.354174 hartree
zpe.thermalcorrener: 0.380110 hartree
zpe.thermalcorrenthalpy: 0.381054 hartree
zpe.thermalcorrgfe: 0.293905 hartree
zpe.sumelectzpe: -1989.396632 hartree
zpe.sumelectthermal: -1989.370697 hartree
zpe.sumelectthermalent: -1989.369753 hartree
zpe.sumelectthermalfe: -1989.456902 hartree
dipole: -0.6262 -0.6210 -0.3182
dipole: 0.9375
quadrupole: -160.7112 -151.9617 -170.8559
quadrupole: 0.0459 2.3419 -10.3292
quadrupole: 0.4650 9.2146 -9.6796 0.0459 2.3419 -10.3292
hfenergy: -1989.7508064 hartree
pointgroup: C01 [X(C19H20Cl2N2O3)]
dipole: 0.248762 0.2640824 -0.0665246 debye
polarizability: 482.57157|17.4399187|232.0542013|-3.7517193|26.868392|177.0578485 unknown
InChI: InChI=1S/C19H20Cl2N2O3/c1-26-18-12-15(23(10-8-20)11-9-21)7-6-14(18)13-22-17-5-3-2-4-16(17)19(24)25/h2-7,12-13,24H,8-11H2,1H3
charge 0 multiplicity 1
46 atoms
Cl 6.218002 2.491481 -0.894075
Cl 6.260915 -2.864294 -0.117131
O  0.447964 0.991616 2.501354
O  -5.075663 2.608975 -0.223237
O  -2.893589 2.10127 0.328332
N  4.307237 -0.162457 -0.249813
N  -2.214965 -0.740915 -0.278363
C  2.9182 -0.157567 -0.05653
C  5.217396 0.416537 0.750883
C  4.907753 -0.765227 -1.450833
C  2.330849 0.434904 1.104755
C  2.025607 -0.744761 -1.017801
C  0.940571 0.41373 1.305631
C  0.055639 -0.196981 0.367851
C  5.340605 1.945824 0.694522
C  5.005957 -2.297345 -1.418066
C  0.643926 -0.755994 -0.800754
C  -1.382566 -0.277553 0.619485
C  -3.607362 -0.83788 -0.147059
C  -4.517025 0.278821 -0.054226
C  -0.140519 2.34471 2.337383
C  -4.164589 -2.148809 -0.256898
C  -5.923181 0.036481 -0.082624
C  -5.551337 -2.363408 -0.241382
C  -6.444856 -1.263618 -0.1585
C  -4.045711 1.67943 0.042102
H  6.213155 -0.039291 0.62445
H  4.883041 0.138504 1.770889
H  4.324615 -0.480181 -2.349652
H  5.911595 -0.333013 -1.594511
H  2.929842 0.917298 1.880792
H  2.410901 -1.203426 -1.931993
H  5.965942 2.329588 1.515684
H  4.366408 2.454286 0.671131
H  5.381052 -2.696507 -2.37345
H  4.061047 -2.781261 -1.133194
H  -0.02782 -1.221686 -1.529731
H  -1.720433 0.037737 1.62091
H  0.641195 3.061919 2.01824
H  -0.515574 2.619988 3.33503
H  -0.968025 2.340318 1.60562
H  -3.467314 -2.98627 -0.358811
H  -6.592106 0.899672 -0.036284
H  -5.940963 -3.385566 -0.307954
H  -7.527494 -1.424613 -0.162961
H  -4.694326 3.521539 -0.117611
