program: Gaussian 09
title: 000266524
version: EM64L-G09RevD.01
frameworkgroup: C1[X(C17H18Cl2N4O)]
method: RPBEPBE
basis: SDD
operation: Freq
keyword: #p
keyword: freq=noraman
keyword: PBEPBE/SDD
title: #p freq=noraman PBEPBE/SDD
converged: YES YES NO NO
title: Mulliken charges:
elementType: Cl Cl O N N N N C C C C C C C C C C C C C C C C C H H H H H H H H H H H H H H H H H H
charge: -0.053820 -0.056454 -0.230937 -0.167994 0.042989 -0.401051 -0.085784 -0.389957 -0.391885 0.455324 -0.366585 -0.351326 -0.583756 -0.584198 0.473702 -0.421921 -0.404923 -0.392979 0.023902 0.191195 -0.255696 -0.180069 -0.165458 -0.356479 0.248424 0.253338 0.249606 0.250938 0.232699 0.234327 0.267770 0.294873 0.269461 0.293728 0.223845 0.282697 0.208732 0.330261 0.284974 0.246313 0.236070 0.246106
chargesum: 0.00000
title: Mulliken charges with hydrogens summed into heavy atoms:
elementType: Cl Cl O N N N N C C C C C C C C C C C C C C C C C
charge: -0.053820 -0.056454 -0.230937 -0.167994 0.042989 -0.070790 -0.085784 0.111805 0.108658 0.455324 -0.133887 -0.116999 -0.021112 -0.021009 0.473702 -0.198076 -0.122226 -0.184247 0.023902 0.191195 0.029278 0.066244 0.070612 -0.110373
polarizability: 5.66270357e+02 1.30965331e+01 2.49903924e+02 5.07830013e+00 2.85045527e+01 1.16130672e+02
1716.lowfreq: -2.5565 0.0001 0.0013 0.0015 1.9592 5.2329 18.3228 21.4839 24.4116
frequency: 18.3017 21.4775 24.3904 30.6459 44.7231 48.6991 61.6814 74.8218 97.7204 104.8675 125.5179 130.0325 161.4930 180.7018 201.6996 208.2203 225.1579 241.4026 252.5140 269.9470 297.8711 344.5005 359.9234 400.2601 402.4579 410.2862 426.0836 449.2615 468.5020 494.6796 524.7853 542.1538 591.3996 616.8877 633.7238 669.1292 677.2665 696.4278 698.6782 737.0538 737.6590 753.8587 783.6931 790.4446 798.2198 807.9738 812.7736 832.8537 833.2629 904.7394 918.7528 926.1393 951.1762 956.0408 970.9384 972.1376 987.5776 996.7006 997.8929 1014.9375 1028.1247 1034.7569 1034.9967 1041.7040 1045.7328 1084.5326 1118.2410 1133.6480 1143.2888 1160.1613 1181.2541 1199.9972 1221.2546 1240.6610 1253.3260 1254.9137 1257.6086 1277.5083 1285.4205 1292.9179 1320.2310 1327.1890 1341.0505 1351.9149 1353.8895 1375.6906 1390.8056 1418.1002 1439.9442 1447.3768 1459.1619 1459.9972 1484.4288 1496.1423 1504.7407 1521.5520 1549.4827 1562.3186 1578.3965 1587.1993 1624.5540 1630.3861 2967.3974 3014.8298 3019.7867 3062.9772 3063.5927 3071.0365 3076.4279 3117.7469 3136.2818 3146.3577 3147.9285 3148.2900 3148.5899 3159.3069 3167.9222 3169.6631 3180.2602 3297.1358
redmass: 7.8507 7.2420 9.8174 14.3244 6.9317 7.2949 3.7879 4.7615 4.4453 3.8294 4.8283 2.6634 5.7653 7.0504 4.2681 4.6706 6.3550 4.4447 5.7428 3.8074 4.5782 5.6754 5.3236 3.5855 3.5971 4.0919 3.5124 3.9325 6.4567 4.1564 3.0651 3.4197 5.0496 7.3942 7.1538 6.8123 4.2863 6.2411 5.9809 3.6606 4.0550 1.7575 1.1272 1.1815 1.1533 1.3406 2.4195 3.6376 1.7884 5.7388 1.3152 1.4110 2.6188 1.5647 1.4475 6.9594 1.3497 2.7602 1.4451 1.3410 3.1576 2.0628 3.9798 2.3218 3.6897 1.6196 1.5474 1.7344 2.0745 1.0865 1.6180 1.1504 2.1191 2.9114 1.2883 1.4412 1.1798 1.3357 1.5707 1.1882 1.6201 4.6033 1.8498 1.3528 1.3571 3.9077 1.8374 2.0242 3.6289 2.2410 1.1013 1.1003 1.0955 1.8962 1.1338 2.8506 6.7135 6.1331 5.5822 5.6107 7.5263 8.0254 1.0868 1.0600 1.0609 1.0573 1.0578 1.1031 1.1038 1.0890 1.0884 1.0951 1.1090 1.1066 1.0904 1.0934 1.0963 1.0952 1.1002 1.0758
irintensity: 0.1392 2.6544 0.3448 0.9490 2.2575 3.2899 0.9352 0.6156 3.4681 5.7793 3.2166 0.2047 0.0299 2.0599 7.5510 6.5633 16.5045 14.5409 11.5789 7.4590 4.0781 14.1277 6.0509 1.4436 9.1737 0.5896 1.5018 0.6238 1.3858 4.0135 20.6563 16.2341 0.9536 11.0531 2.8687 102.0676 19.5451 60.1071 52.0732 2.2582 6.1057 59.0335 2.8619 11.9298 100.2532 4.3131 15.4438 14.7963 29.0524 33.5297 0.1756 23.0463 52.6317 24.4043 1.5344 12.2769 2.8326 0.3346 4.2237 0.6962 0.1514 0.8594 0.2671 2.5581 29.8928 25.7524 34.3422 36.5807 56.5789 3.0233 157.2427 71.3338 32.3233 10.1161 1.1430 45.4102 29.5596 84.0452 13.6857 7.8942 14.9588 2.3793 52.0740 46.3790 92.8080 29.2000 80.9979 34.9623 27.6983 57.9049 13.3196 13.7112 27.6493 630.2607 34.4601 105.6591 37.2053 20.2888 149.6165 0.6308 605.9919 148.1256 59.6915 23.7329 29.8326 9.5307 20.2729 9.3897 8.5937 15.6016 11.7409 11.4789 16.0505 7.8400 14.0262 29.1210 17.5755 15.5674 20.2443 60.3362
temp: 298.150 k
press: 1.00000 atm
elementType: 17 17 8 7 7 7 7 6 6 6 6 6 6 6 6 6 6 6 6 6 6 6 6 6 1 1 1 1 1 1 1 1 1 1 1 1 1 1 1 1 1 1
symmnumber: 1
zpe: 851282.1 jmol-1
zpe.correction: 0.324236 hartree
zpe.thermalcorrener: 0.347283 hartree
zpe.thermalcorrenthalpy: 0.348227 hartree
zpe.thermalcorrgfe: 0.266770 hartree
zpe.sumelectzpe: -1871.196099 hartree
zpe.sumelectthermal: -1871.173053 hartree
zpe.sumelectthermalent: -1871.172108 hartree
zpe.sumelectthermalfe: -1871.253566 hartree
dipole: 2.3938 -3.9466 -1.0318
dipole: 4.7297
quadrupole: -112.4678 -168.8346 -156.7293
quadrupole: -15.8981 -2.7902 1.7796
quadrupole: 33.5427 -22.8240 -10.7187 -15.8981 -2.7902 1.7796
hfenergy: -1871.5203354 hartree
pointgroup: C01 [X(C17H18Cl2N4O1)]
dipole: -0.9409352 1.5627094 -0.3677286 debye
polarizability: 566.2906985|13.3397361|251.3133057|-3.4074433|-24.9108276|114.7009494 unknown
InChI: InChI=1S/C17H18Cl2N4O/c18-8-11-23(12-9-19)15-6-4-14(5-7-15)13-21-22-17(24)16-3-1-2-10-20-16/h1-7,10,13,22H,8-9,11-12H2
charge 0 multiplicity 1
42 atoms
Cl 6.29871 -3.952538 -0.196488
Cl 7.206535 3.331899 0.373186
O  -3.829328 -2.099101 0.491164
N  4.852789 -0.065895 -0.006466
N  -1.691276 -0.245492 0.02728
N  -3.033908 0.067879 -0.042724
N  -5.496019 1.043343 -0.239855
C  5.437719 -1.353902 0.408118
C  5.790977 1.018126 -0.345692
C  3.455701 0.126689 -0.063919
C  2.893309 1.397165 -0.40017
C  2.546842 -0.946503 0.214803
C  5.539077 -2.32453 -0.784247
C  6.028709 1.937871 0.867558
C  0.601684 0.512418 -0.171441
C  1.500625 1.575936 -0.453425
C  1.160608 -0.75473 0.164365
C  -0.841394 0.733673 -0.226639
C  -5.405423 -0.289264 0.075715
C  -4.018712 -0.884878 0.200146
C  -6.537549 -1.10811 0.288406
C  -7.819053 -0.528046 0.172034
C  -7.924292 0.845034 -0.151971
C  -6.737335 1.589905 -0.349202
H  6.448834 -1.177149 0.815589
H  4.84704 -1.81303 1.219957
H  6.75413 0.579591 -0.660764
H  5.418816 1.608834 -1.201079
H  3.535782 2.255489 -0.616734
H  2.922066 -1.941869 0.469784
H  6.207191 -1.947984 -1.573061
H  4.556114 -2.582904 -1.203065
H  6.518011 1.411464 1.700471
H  5.106658 2.428211 1.210761
H  1.102952 2.565237 -0.713519
H  0.478128 -1.583168 0.380184
H  -1.180482 1.757435 -0.488159
H  -3.389916 1.016542 -0.269365
H  -6.38127 -2.161671 0.536605
H  -8.718333 -1.13209 0.330652
H  -8.899118 1.332133 -0.250802
H  -6.776697 2.655177 -0.601893
