program: Gaussian 09
title: 000266518
version: EM64L-G09RevD.01
frameworkgroup: C1[X(C9H7ClN2O)]
method: RPBEPBE
basis: SDD
operation: Freq
keyword: #p
keyword: freq=noraman
keyword: PBEPBE/SDD
title: #p freq=noraman PBEPBE/SDD
converged: NO NO NO NO
title: Mulliken charges:
elementType: Cl O N N C C C C C C C C C H H H H H H H
charge: -0.023520 -0.264180 -0.251798 0.028347 0.151438 0.412261 -0.327716 -0.287606 -0.262776 0.285892 -0.801353 -0.285687 -0.206365 0.308087 0.276038 0.253358 0.240000 0.239994 0.239962 0.275623
chargesum: 0.00000
title: Mulliken charges with hydrogens summed into heavy atoms:
elementType: Cl O N N C C C C C C C C C
charge: -0.023520 -0.264180 -0.251798 0.028347 0.151438 0.412261 -0.019629 -0.011567 -0.009417 0.285892 -0.081397 -0.010064 -0.206365
polarizability: 2.10789289e+02 4.71157411e+00 1.32692885e+02 -7.46462590e-03 1.43851636e-03 5.12362453e+01
1716.lowfreq: -0.0016 -0.0007 0.0014 4.4908 6.8840 14.4030 64.0529 108.9059 149.0314
frequency: 64.0362 108.9029 149.0294 169.0242 182.4399 197.8617 261.4906 319.1690 344.9098 367.2285 430.1512 480.3791 502.7517 532.4470 533.1653 582.0009 628.8693 672.9564 692.1450 757.0687 788.4829 828.9224 843.9149 862.7957 883.7429 921.6688 993.3151 998.1900 1039.0954 1054.2578 1083.8088 1129.2239 1170.1095 1229.5130 1252.4542 1298.3005 1313.4250 1367.7895 1406.1065 1428.2161 1467.2811 1469.2252 1486.2706 1511.5208 1551.9706 1638.9710 1661.3299 2983.1439 3061.2776 3098.8030 3144.9947 3170.4496 3193.6839 3209.1053
redmass: 5.4272 1.0570 6.1623 4.4299 5.9994 4.8989 5.4485 14.0590 4.5939 4.3267 3.8286 8.0139 6.0799 8.4735 2.9804 6.1335 7.7983 3.8580 6.1414 4.4442 6.1024 1.5188 1.4406 5.6726 8.2697 1.3231 1.3198 1.6178 2.4788 1.5214 2.8473 2.0921 1.8226 3.7154 1.6424 1.8647 3.5114 2.6381 1.2472 4.9541 1.0443 1.3314 3.2986 4.4993 7.3623 6.8266 9.2439 1.0377 1.0978 1.0989 1.0912 1.0933 1.0960 1.0933
irintensity: 0.9275 0.2007 0.2241 3.4934 0.4348 2.7330 4.5877 5.7426 6.8902 3.3556 0.9569 3.8194 4.7064 1.9918 11.2068 6.1940 2.6183 0.8228 1.9926 0.2712 35.5331 33.5045 54.2512 52.3380 62.1723 6.9990 2.3900 2.5725 4.2206 13.2517 86.5047 36.4834 3.1721 2.5209 4.3459 12.0782 29.3067 22.6010 5.6776 262.5751 15.7219 91.5875 233.6587 178.2365 28.1501 178.5986 305.3979 26.3535 14.9818 12.2583 7.8129 11.8962 1.1887 1.8186
temp: 298.150 k
press: 1.00000 atm
elementType: 17 8 7 7 6 6 6 6 6 6 6 6 6 1 1 1 1 1 1 1
symmnumber: 1
zpe: 373937.0 jmol-1
zpe.correction: 0.142425 hartree
zpe.thermalcorrener: 0.153253 hartree
zpe.thermalcorrenthalpy: 0.154197 hartree
zpe.thermalcorrgfe: 0.105382 hartree
zpe.sumelectzpe: -991.042275 hartree
zpe.sumelectthermal: -991.031447 hartree
zpe.sumelectthermalent: -991.030503 hartree
zpe.sumelectthermalfe: -991.079318 hartree
dipole: -5.5282 -2.2182 -0.0014
dipole: 5.9567
quadrupole: -70.9996 -89.2529 -83.4765
quadrupole: 7.6372 0.0004 -0.0067
quadrupole: 10.2434 -8.0099 -2.2335 7.6372 0.0004 -0.0067
hfenergy: -991.1846999 hartree
pointgroup: C01 [X(C9H7Cl1N2O1)]
dipole: 2.2478345 -0.6628544 0.0005531 debye
dipolederiv: -1.0222964 -0.2291392 -0.0001154 -0.2973161 -0.2021598 -0.0000325 -0.0002694 -0.0001772 -0.0733745 -0.4131072 -0.3381035 -0.0000792 -0.0231433 -1.3236748 -0.0003519 0.0001608 0.0013034 -0.3563976 -0.3812496 0.3711579 -0.0000767 -0.2569048 -0.6194756 0.0002189 0.0002471 -0.0002033 0.0314535 -1.8899194 0.3453638 0.0000883 0.3860051 -0.6021087 0.0000464 0.0000784 0.0001308 -0.2048245 1.3498935 -0.0884081 -0.0002059 0.284354 0.1433952 -0.0001088 -0.0001679 -0.0000986 0.1271177 0.5409565 0.2216725 -0.0000742 -0.2679843 -0.0890933 0.0000193 -0.0002065 -0.0001167 -0.0460569 -0.2150214 -0.2049696 0.0000534 0.2421449 0.0034616 0.0000819 0.0001803 0.0000747 -0.0579103 -0.5387317 0.0409202 0.0000312 0.1637112 0.0651984 -0.0000144 0.0000014 0.0000234 -0.1479377 0.1952184 -0.1306115 -0.0000606 0.1490797 0.1570234 0.0000112 -0.0000453 0.0000628 -0.1073935 0.5147238 0.407574 0.0000719 -0.1738457 1.7237007 0.0000881 -0.0003615 -0.0008928 0.1889792 -0.150395 -0.0396399 0.0000262 0.03624 0.0477862 -0.0000054 0.0000359 0.0000336 0.0568528 -0.4471602 -0.6270264 0.0001118 -0.0069646 -0.675471 -0.0001 -0.0000283 -0.000157 -0.1905823 2.162715 0.1155698 0.0002138 -0.2526892 1.1301876 0.0002232 0.0004698 0.0000226 0.0354837 0.1239171 0.0123238 0.0000214 -0.0693059 0.0894847 -0.000029 0.0000174 -0.0000003 0.1760667 0.0827896 -0.0475545 0.0000136 -0.0089696 0.0114386 -0.0000094 -0.0000005 -0.0000203 0.1679089 -0.0071297 0.1002702 0.0000374 0.0880852 0.0318879 -0.0000271 0.0000743 -0.0000297 0.1491238 -0.0214671 0.0075789 0.0680703 0.0166307 0.0776703 -0.0844311 0.1230213 -0.055187 -0.0283604 -0.0215367 0.0076219 -0.0680792 0.0166865 0.0776447 0.0844495 -0.1230287 0.0552077 -0.0282822 0.079696 0.0465812 0.0000112 -0.0689317 -0.1086314 -0.0000175 -0.000004 -0.0000355 0.117197 0.0581045 0.0288185 -0.0000594 0.0431177 0.0617352 -0.0000112 -0.0001747 0.0000595 0.1909367 unknown
polarizability: 210.9773951|2.7337086|132.5047792|-0.0072949|-0.0021388|51.2362453 unknown
InChI: InChI=1S/C9H7ClN2O/c1-6-2-3-8-11-7(10)4-9(13)12(8)5-6/h2-5H,1H3
charge 0 multiplicity 1
20 atoms
Cl -4.097986 -1.025161 -0.000278
O  -0.485017 2.71605 -0.000786
N  0.206803 0.439305 0.000264
N  -1.422596 -1.359125 0.000354
C  -0.134823 -0.930592 0.000186
C  2.588959 -0.035512 -0.000231
C  1.531105 0.864284 0.000083
C  0.947313 -1.870363 -0.000101
C  2.268513 -1.440303 -0.000325
C  -0.849082 1.505553 0.000973
C  4.026194 0.440198 -0.000408
C  -2.182687 0.972419 0.000319
C  -2.38339 -0.409852 0.000325
H  1.642312 1.952163 0.000298
H  0.668063 -2.926172 -0.000152
H  3.081157 -2.175252 -0.000557
H  4.566982 0.068111 -0.890432
H  4.567262 0.06792 0.889367
H  4.088019 1.540844 -0.000297
H  -3.011299 1.681086 -0.000201
