program: Gaussian 09
title: 000266515
version: EM64L-G09RevD.01
frameworkgroup: C1[X(C12H17ClN2O8S2)]
method: RPBEPBE
basis: SDD
operation: Freq
keyword: #p
keyword: freq=noraman
keyword: PBEPBE/SDD
title: #p freq=noraman PBEPBE/SDD
converged: NO YES NO NO
title: Mulliken charges:
elementType: Cl S S O O O O O O O O N N C C C C C C C C C C C C H H H H H H H H H H H H H H H H H
charge: 0.022426 1.065795 1.066488 -0.400638 -0.401709 -0.495248 -0.570344 -0.494680 -0.570861 -0.230663 -0.199935 -0.149969 0.010075 -0.433505 -0.440573 0.489740 -0.295099 -0.294361 -0.326025 -0.353371 -0.327247 -0.391768 0.503580 -0.751991 -0.752380 0.232311 0.299580 0.235809 0.300172 0.241690 0.263029 0.243162 0.263624 0.260388 0.238054 0.288646 0.355303 0.280394 0.292374 0.355035 0.280291 0.292399
chargesum: 0.00000
title: Mulliken charges with hydrogens summed into heavy atoms:
elementType: Cl S S O O O O O O O O N N C C C C C C C C C C C C
charge: 0.022426 1.065795 1.066488 -0.400638 -0.401709 -0.495248 -0.570344 -0.494680 -0.570861 -0.230663 -0.199935 -0.149969 0.010075 0.098385 0.095408 0.489740 0.209620 0.212426 -0.065637 -0.115317 -0.327247 -0.103122 0.503580 0.176080 0.175345
polarizability: 4.00765040e+02 -3.72037526e+00 2.36398935e+02 -9.92017917e-02 2.31010104e+01 1.65270645e+02
1716.lowfreq: -3.4605 -0.0021 -0.0014 -0.0010 3.4217 4.7042 20.0853 21.0597 31.9872
frequency: 19.9207 21.0421 31.9759 38.2192 45.1773 53.3111 61.4234 70.3846 75.9199 90.8008 93.4577 96.5713 120.2161 156.6161 163.9249 175.8831 190.5543 202.6982 206.1310 210.5317 213.1573 224.1106 227.0388 256.6997 258.0600 280.2541 291.2813 320.4471 334.6366 339.0185 342.7091 356.6263 368.9351 389.8232 404.4147 419.1340 449.2158 473.5592 483.1205 487.3953 512.8125 531.4123 557.7522 574.4353 584.9146 597.3853 600.2970 659.4819 663.8320 707.1819 730.7770 787.5545 812.5938 825.1892 832.9237 835.3438 838.1758 841.1244 903.4895 908.9616 918.0494 921.4187 975.3631 981.0351 989.8429 1003.5778 1008.2154 1013.1925 1030.5950 1051.4192 1058.6280 1066.0008 1080.3188 1123.8849 1166.8421 1181.1962 1204.6824 1216.1681 1216.2209 1254.5525 1272.7663 1277.4846 1327.2553 1328.2690 1334.9910 1337.3760 1350.2376 1356.8494 1361.7459 1382.5497 1394.0722 1414.5797 1416.0505 1432.5268 1436.1772 1436.7108 1437.2071 1440.2289 1482.1704 1489.1457 1507.9376 1540.2881 1618.9028 2983.4637 2983.8884 3008.0135 3010.3471 3022.8799 3024.9644 3066.3928 3066.8356 3084.5144 3087.6856 3156.6291 3157.7335 3165.1193 3183.0857 3186.2385 3188.9327 3189.2089
redmass: 7.8401 7.4722 15.5143 6.7679 7.8603 10.9425 6.5127 5.5101 8.5518 8.0051 7.5968 7.6061 8.5102 5.2238 3.2654 3.0856 4.6601 1.5641 4.4999 1.8764 1.6790 3.5525 4.3227 4.4841 4.8226 5.2153 7.3192 8.2087 6.6211 8.3174 10.9509 6.0947 4.7949 4.0403 4.5564 3.7913 3.2384 4.3364 3.8000 5.7483 1.9417 4.1511 4.7285 5.1762 4.9552 9.1564 8.9531 6.3418 3.9544 4.8030 6.5869 5.1246 1.4835 4.1507 7.9961 4.7447 1.9049 6.1702 2.8573 2.7340 3.9520 3.7729 1.3249 2.3994 1.7967 4.0296 1.3780 1.5269 3.1943 2.1333 1.7180 1.6498 2.3786 2.3725 2.5214 1.8916 3.2683 1.3702 1.1996 1.2817 1.4049 1.2916 1.1262 1.1304 1.2200 1.2491 4.6593 1.2707 1.3396 3.8222 2.4794 1.0435 1.0444 1.0539 1.0571 1.2593 1.1661 2.4560 1.1294 1.3692 2.1053 7.6449 6.6577 1.0621 1.0622 1.0272 1.0267 1.0619 1.0624 1.1023 1.1026 1.1019 1.1016 1.1065 1.1067 1.0873 1.0938 1.0926 1.1077 1.1076
irintensity: 1.0491 1.1849 0.2278 2.0400 1.5896 0.5235 1.4932 1.8025 0.0583 1.7764 12.3306 17.6050 5.4025 4.7359 2.1832 17.1935 0.3295 1.5121 2.4411 6.6513 4.5325 8.4143 4.2755 10.4402 4.3972 1.3131 1.3329 8.8052 17.2967 11.3655 1.3650 3.0863 4.4729 17.3962 9.4548 2.6533 9.9910 10.9159 63.4474 187.8771 16.1057 17.6238 1.6622 4.6236 2.1113 5.9131 94.7412 3.5341 15.8382 3.4249 10.2457 34.3636 27.8789 9.7328 65.9897 6.5833 8.3029 128.4553 91.0520 52.4846 27.5613 137.2159 4.3511 6.3215 191.5165 56.8369 26.9048 1.8671 6.4428 77.2014 90.4933 7.9874 3.1005 0.7592 86.1441 122.8159 656.7893 59.6672 29.9567 23.3738 1.0471 8.2222 6.8965 23.9835 0.7245 47.3660 72.5946 2.3826 79.4416 53.7135 63.8606 3.1720 4.4538 14.3990 14.4399 5.8839 10.7096 23.1239 31.0627 71.3573 58.6345 66.3983 626.7745 15.5679 6.6653 2.7246 70.5735 29.2600 1.1466 11.4389 2.9088 0.4836 1.3046 5.0924 60.4501 6.7935 3.3633 10.9889 2.3788 0.2819
temp: 298.150 k
press: 1.00000 atm
elementType: 17 16 16 8 8 8 8 8 8 8 8 7 7 6 6 6 6 6 6 6 6 6 6 6 6 1 1 1 1 1 1 1 1 1 1 1 1 1 1 1 1 1
symmnumber: 1
zpe: 776093.5 jmol-1
zpe.correction: 0.295598 hartree
zpe.thermalcorrener: 0.323666 hartree
zpe.thermalcorrenthalpy: 0.324610 hartree
zpe.thermalcorrgfe: 0.234138 hartree
zpe.sumelectzpe: -2432.580777 hartree
zpe.sumelectthermal: -2432.552709 hartree
zpe.sumelectthermalent: -2432.551765 hartree
zpe.sumelectthermalfe: -2432.642238 hartree
dipole: -9.7466 -0.0408 -0.2089
dipole: 9.7490
quadrupole: -222.8218 -186.7835 -164.2428
quadrupole: 0.9921 -0.2887 -7.1706
quadrupole: -31.5391 4.4992 27.0399 0.9921 -0.2887 -7.1706
hfenergy: -2432.8763753 hartree
pointgroup: C01 [X(C12H17Cl1N2O8S2)]
dipole: 3.7077207 -0.9700797 0.1520554 debye
polarizability: 390.5873897|-42.5298608|224.3817324|-7.8466374|-39.4764101|187.4654973 unknown
InChI: InChI=1S/C12H17ClN2O8S2/c1-24(18,19)22-7-5-14(6-8-23-25(2,20)21)10-3-4-12(15(16)17)11(13)9-10/h3-4,9H,5-8H2,1-2H3
charge 0 multiplicity 1
42 atoms
Cl -3.997613 2.824212 -1.780523
S  3.360806 -2.994346 0.438205
S  4.211633 1.417625 -0.5177
O  1.669515 -2.56579 -0.258054
O  2.547316 1.663086 0.315025
O  3.282817 -4.461131 1.110428
O  3.907517 -1.766038 1.354426
O  4.653324 2.810625 -1.205835
O  4.166197 0.086791 -1.451774
O  -6.334892 0.502099 1.403621
O  -6.374603 1.669655 -0.55485
N  -0.102319 -0.003709 0.115897
N  -5.745571 1.024277 0.368679
C  0.561336 -0.825978 1.148716
C  0.744107 0.516883 -0.977614
C  -1.467231 0.271094 0.174162
C  0.650242 -2.324352 0.795596
C  1.435773 1.856443 -0.652399
C  -2.065026 1.247124 -0.687293
C  -2.336001 -0.401584 1.099586
C  -3.440812 1.517262 -0.653334
C  -3.700031 -0.113351 1.134963
C  -4.291687 0.837169 0.259935
C  4.205152 -3.017826 -1.255031
C  5.127249 1.08564 1.104528
H  0.030722 -0.706281 2.10953
H  1.581557 -0.4356 1.303113
H  0.13328 0.630505 -1.890576
H  1.516431 -0.235805 -1.20962
H  0.881594 -2.932442 1.693671
H  -0.287238 -2.702043 0.350053
H  1.814533 2.343035 -1.57413
H  0.756891 2.561491 -0.140535
H  -1.456535 1.832328 -1.379014
H  -1.950315 -1.169003 1.77431
H  -4.365587 -0.627278 1.833863
H  4.201552 -1.967896 -1.586971
H  5.215802 -3.410846 -1.07611
H  3.595259 -3.683581 -1.879371
H  4.746401 0.110784 1.447067
H  6.194743 1.065645 0.84393
H  4.867417 1.921905 1.76643
