program: Gaussian 09
title: 000266508
version: EM64L-G09RevD.01
frameworkgroup: C1[X(C13H12O2)]
method: RPBEPBE
basis: SDD
operation: Freq
keyword: #pfreq=noraman
keyword: PBEPBE/SDD
title: #p freq=noraman PBEPBE/SDD
converged: YES YES NO NO
title: Mulliken charges:
elementType: O O C C C C C C C C C C C C C H H H H H H H H H H H H
charge: -0.233002 -0.223366 -0.138502 -0.467312 -0.162726 -0.126914 -0.344591 0.493737 -0.308260 0.185848 -0.387437 -0.396510 -0.233573 -0.235193 -0.239406 0.235710 0.237064 0.244111 0.244919 0.235709 0.221036 0.254464 0.226621 0.228806 0.228058 0.228942 0.231769
chargesum: 0.00000
title: Mulliken charges with hydrogens summed into heavy atoms:
elementType: O O C C C C C C C C C C C C C
charge: -0.233002 -0.223366 0.097207 0.013863 0.082193 0.108795 -0.123555 0.493737 -0.053796 0.185848 -0.160817 -0.167705 -0.005515 -0.006251 -0.007638
polarizability: 2.48779078e+02 4.60375989e+00 1.08009036e+02 8.71371959e-01 7.87785711e+00 1.10652727e+02
1716.lowfreq: -10.9345 -4.3437 -0.0434 -0.0005 0.0004 0.0007 21.2465 42.8891 59.6056
frequency: 20.8845 42.8751 59.5978 86.6546 130.5106 138.2003 219.8924 239.6378 310.1701 322.7319 342.9754 403.2090 437.3427 463.0031 489.9447 516.9669 546.5613 601.1553 616.1666 638.4771 695.7359 708.2896 763.0082 790.8991 813.4246 833.2041 846.7157 861.3158 875.2429 924.5960 945.4772 970.0663 977.5246 982.1086 989.0583 992.5710 999.2704 1026.6224 1043.1249 1082.9084 1123.5942 1139.3630 1170.8863 1174.7463 1192.7233 1210.9940 1226.6397 1248.2690 1291.5034 1301.6780 1316.4753 1333.9846 1359.9373 1362.5009 1389.9799 1437.9691 1441.8676 1486.4932 1585.5237 1612.7719 1618.5319 1658.5167 1669.6327 2972.6956 2995.1559 3047.4490 3079.6050 3115.4222 3118.7444 3127.7343 3128.0342 3139.8605 3150.3826 3166.5030 3177.2130
redmass: 4.2289 5.5560 4.6645 3.5294 3.3023 6.2249 5.7226 2.3313 3.6068 3.4327 3.7581 2.7795 4.3041 5.1983 5.3090 3.2013 4.0947 5.2346 6.4065 2.1565 1.7867 3.8422 1.7589 2.5596 3.0057 4.0681 1.3397 3.1173 2.6315 1.5124 2.9415 2.2180 1.3589 1.2193 5.6441 1.3951 1.3120 2.2270 2.8140 1.6760 1.8210 2.3536 1.1650 1.0914 1.1191 1.5495 2.0202 1.3699 1.3244 1.3946 1.3275 1.3451 1.6173 1.8717 4.6734 1.0924 2.2510 2.3124 5.7672 5.9862 8.7161 7.9675 6.3302 1.0665 1.0836 1.0953 1.0904 1.0896 1.0872 1.0860 1.0894 1.0912 1.0961 1.1015 1.0978
irintensity: 1.8130 2.3570 0.6978 0.5206 0.3109 0.5217 0.7100 4.6817 2.6865 5.0521 1.3209 0.0518 1.7100 4.1300 16.9752 6.3645 8.4226 3.2216 0.0683 7.5846 43.2988 4.3813 59.1869 44.3961 60.4305 5.2776 1.0865 19.4166 50.5493 1.9192 83.4762 110.1655 4.2884 32.7675 0.1139 20.3449 6.5102 9.8373 36.0857 8.4537 47.5760 54.4298 2.0497 0.7378 1.6464 157.5407 1.2984 1.1448 1.1398 2.8250 12.4361 2.4720 8.4234 51.8960 9.1469 16.3112 9.6652 17.0700 3.3073 2.6099 96.7619 228.4887 20.4502 7.2255 24.5301 16.3200 17.1010 11.9914 13.9674 1.5057 16.1809 9.5118 40.9999 25.3263 11.6949
temp: 298.150 k
press: 1.00000 atm
elementType: 8 8 6 6 6 6 6 6 6 6 6 6 6 6 6 1 1 1 1 1 1 1 1 1 1 1 1
symmnumber: 1
zpe: 558186.5 jmol-1
zpe.correction: 0.212602 hartree
zpe.thermalcorrener: 0.225610 hartree
zpe.thermalcorrenthalpy: 0.226554 hartree
zpe.thermalcorrgfe: 0.170977 hartree
zpe.sumelectzpe: -651.933632 hartree
zpe.sumelectthermal: -651.920624 hartree
zpe.sumelectthermalent: -651.919680 hartree
zpe.sumelectthermalfe: -651.975257 hartree
dipole: -2.4644 -5.4182 0.9910
dipole: 6.0343
quadrupole: -84.8733 -95.3030 -81.2579
quadrupole: -20.3301 3.7011 5.0207
quadrupole: 2.2714 -8.1583 5.8868 -20.3301 3.7011 5.0207
hfenergy: -652.1462339 hartree
pointgroup: C01 [X(C13H12O2)]
dipole: -0.9857074 1.8078476 1.1816445 debye
polarizability: 248.7582339|-0.6875589|101.3357164|-4.8338193|-0.8603572|117.3468905 unknown
InChI: InChI=1S/C13H12O2/c14-13-8-4-7-12(15-13)10-9-11-5-2-1-3-6-11/h1-6,8-10,12H,7H2
charge 0 multiplicity 1
27 atoms
O  2.386477 -0.684481 -0.604711
O  4.408385 -1.650784 -1.100153
C  1.637078 0.241028 0.333788
C  2.316195 1.627036 0.363326
C  0.219807 0.273651 -0.157821
C  3.800626 1.4825 0.621481
C  -0.845512 -0.103665 0.603936
C  -2.271214 -0.079399 0.222183
C  4.465252 0.352051 0.253079
C  3.794952 -0.7372 -0.506038
C  -2.724427 0.31543 -1.069762
C  -3.244248 -0.472887 1.183785
C  -4.097779 0.316618 -1.382143
C  -4.620496 -0.470819 0.872552
C  -5.054248 -0.074955 -0.413202
H  1.692712 -0.215624 1.342617
H  1.836715 2.240872 1.147773
H  2.146467 2.156607 -0.597319
H  0.091157 0.630601 -1.188212
H  4.337945 2.312715 1.096776
H  -0.640879 -0.46888 1.622572
H  5.539043 0.219512 0.414807
H  -2.000987 0.615385 -1.835848
H  -2.913184 -0.784029 2.182659
H  -4.427651 0.620011 -2.38208
H  -5.351663 -0.778167 1.628344
H  -6.12152 -0.073227 -0.66029
